program: Gaussian 09
title: 000139601
version: EM64L-G09RevD.01
frameworkgroup: C1[X(C10H10N2)]
method: RPBEPBE
basis: SDD
operation: Freq
keyword: #pfreq=noraman
keyword: PBEPBE/SDD
title: #p freq=noraman PBEPBE/SDD
converged: YES YES NO NO
title: Mulliken charges:
elementType: N N C C C C C C C C C C H H H H H H H H H H
charge: -0.420597 -0.034413 0.053872 0.261419 0.318667 -0.422287 -0.400909 -0.400959 -0.763309 -0.216031 -0.216034 -0.243144 0.268905 0.321588 0.244579 0.244566 0.214849 0.254053 0.254080 0.226251 0.226249 0.228604
chargesum: 0.00000
title: Mulliken charges with hydrogens summed into heavy atoms:
elementType: N N C C C C C C C C C C
charge: -0.099009 -0.034413 0.053872 0.261419 0.318667 -0.153382 -0.156330 -0.156393 -0.040326 0.010219 0.010215 -0.014540
polarizability: 1.53009878e+02 4.17849769e+00 8.96183080e+01 -5.11515977e-03 3.09315176e-02 9.54664571e+01
1716.lowfreq: -93.9608 -51.7260 -12.6812 -9.4449 -8.7424 -0.0004 0.0003 0.0008 78.3125
frequency: -93.9130 -51.6106 78.2971 99.5439 225.2252 233.3820 310.9221 384.4134 401.6610 404.1032 530.6556 596.2078 611.5408 653.2032 657.9805 689.4092 694.8581 706.3059 771.0634 847.2169 854.8564 909.3805 922.8871 976.7917 979.8467 987.6364 995.4158 1000.9736 1037.2549 1037.6085 1067.3194 1074.5025 1171.0513 1176.7114 1184.8936 1220.2949 1279.4371 1307.8714 1333.0979 1366.8129 1384.6055 1411.3373 1428.4978 1449.7289 1457.4916 1485.2608 1496.7031 1577.1810 1581.9612 1621.1487 2984.6800 3067.8894 3082.1521 3121.2055 3127.3088 3140.0993 3148.5489 3163.6202 3224.2900 3606.1845
redmass: 1.0153 3.8287 4.0468 5.1308 3.4561 3.0884 5.4176 3.5051 3.0688 4.6843 3.2572 2.3216 6.3191 5.0347 1.7397 5.4323 4.1130 1.6863 1.9506 1.3160 1.2417 4.6897 1.4180 1.3825 1.6216 5.8228 1.3481 4.7119 1.4383 1.9145 4.0748 1.5970 1.0534 2.6447 1.1195 2.4993 2.1053 1.3768 5.4391 6.7159 2.0555 1.2892 2.2116 2.1274 1.0446 1.3254 2.7191 5.4592 6.0165 6.7244 1.0366 1.0983 1.0993 1.0843 1.0877 1.0925 1.0969 1.1018 1.0979 1.0820
irintensity: 0.0711 0.7207 1.3034 0.4135 0.8090 0.7818 0.2852 0.2207 0.2844 1.4668 13.4379 30.9110 1.1552 5.1870 59.8616 2.3085 9.7223 56.9335 42.1152 28.9648 0.1240 34.1499 2.1673 0.0051 7.9051 0.3053 0.5413 5.8024 3.1610 3.5853 23.4766 10.4782 0.0171 7.9572 0.2816 0.4165 12.6313 0.1608 13.5061 0.0038 0.4523 8.6618 5.3480 2.7100 19.0075 28.3941 15.6952 6.0187 1.8122 13.8173 26.7730 11.3362 23.8838 2.2054 0.5187 20.4404 41.5081 19.9463 2.2794 61.5582
temp: 298.150 k
press: 1.00000 atm
elementType: 7 7 6 6 6 6 6 6 6 6 6 6 1 1 1 1 1 1 1 1 1 1
symmnumber: 1
zpe: 462599.1 jmol-1
zpe.correction: 0.176195 hartree
zpe.thermalcorrener: 0.184837 hartree
zpe.thermalcorrenthalpy: 0.185782 hartree
zpe.thermalcorrgfe: 0.141922 hartree
zpe.sumelectzpe: -495.707370 hartree
zpe.sumelectthermal: -495.698727 hartree
zpe.sumelectthermalent: -495.697783 hartree
zpe.sumelectthermalfe: -495.741643 hartree
dipole: 0.5573 3.0479 -0.0031
dipole: 3.0985
quadrupole: -64.4238 -71.4043 -66.8749
quadrupole: -10.3994 0.0101 0.0096
quadrupole: 3.1439 -3.8367 0.6928 -10.3994 0.0101 0.0096
hfenergy: -495.8835647 hartree
pointgroup: C01 [X(C10H10N2)]
dipole: -0.2595031 -1.1910878 0.000086 debye
dipolederiv: -0.4841907 0.2049136 0.0000133 0.2975793 -0.1699972 -0.000058 -0.0001516 0.0000665 -0.2219944 -0.4847871 -0.2200284 -0.00002 -0.342748 -0.1623307 0.0000501 0.000151 0.0000026 -0.2108733 0.0490991 0.0345 -0.00003 -0.0229957 -0.2322598 0.0000177 -0.0000319 0.0000169 -0.1349448 0.3514548 -0.1785956 0.0000518 -0.0995457 0.237222 -0.0000454 0.0002003 -0.0003924 -0.0236053 0.4644652 -0.017327 -0.0000082 0.0033874 -0.0580906 -0.0000276 -0.000025 -0.0000236 0.0295904 0.0731888 0.14452 0.0000185 0.1859001 0.2461024 0.000006 -0.0001146 -0.000003 -0.1187045 -0.1735907 0.0152584 -0.0719002 0.014787 -0.1331408 -0.0095378 -0.0640969 -0.0131251 0.0525729 -0.173579 0.0151859 0.0719191 0.0147243 -0.1331761 0.0093227 0.0641631 0.0129419 0.0525631 0.0383554 -0.07071 -0.0002108 -0.0495767 -0.0597027 -0.0000274 -0.0001623 0.0003966 0.0729567 -0.0180613 0.0108029 0.0750065 0.0097124 -0.149021 0.0031693 0.0699555 0.0072714 0.0857509 -0.0180593 0.0108793 -0.0749807 0.0097234 -0.1489953 -0.0034188 -0.0699306 -0.0075237 0.0857662 0.0783613 0.0194693 0.0000019 0.013398 -0.1679747 -0.0000539 -0.0000035 -0.0000605 -0.0727985 0.0934909 0.0367379 -0.0000037 0.0348574 -0.0232084 -0.0000039 0.0000081 0.0000119 0.1599756 0.2273051 0.0023866 -0.0000004 0.0018086 0.1658681 -0.0000111 0.0000086 -0.0000115 0.3238194 0.0499888 -0.009933 0.0983955 -0.0104085 0.1376837 0.0036716 0.0913581 0.0026084 -0.0426902 0.0499525 -0.0098242 -0.0984266 -0.0103024 0.1376841 -0.0034561 -0.0913925 -0.0024182 -0.0426902 -0.124075 0.1424272 0.0004341 0.059443 0.013676 -0.0001083 0.0004141 -0.0003232 0.1201128 0.0666729 -0.0529973 0.0961206 -0.0351845 0.0149743 0.0093001 0.0891222 0.0807735 -0.0243277 0.0660686 -0.0532329 -0.0963643 -0.035341 0.0153889 -0.0090872 -0.0894571 -0.080497 -0.0236886 0.0064872 -0.0043828 -0.0895888 -0.0101815 0.1540916 -0.0051992 -0.1083808 -0.0038161 -0.0768569 0.0065128 -0.0044776 0.0895667 -0.0102962 0.1540783 0.0054556 0.108361 0.0040655 -0.0768742 -0.1450602 -0.0155723 0.0000056 -0.0187408 0.1611277 0.0000415 0.0000048 0.000039 0.0869406 unknown
polarizability: 153.219225|2.0359727|89.4089014|-0.001888|-0.0247402|95.4665167 unknown
InChI: InChI=1S/C10H10N2/c1-8-10(7-11-12-8)9-5-3-2-4-6-9/h2-7,12H,1H3
charge 0 multiplicity 1
22 atoms
N  3.066806 -0.244114 -0.000182
N  3.050808 1.145573 -0.000237
C  0.896815 0.26291 -0.000102
C  1.804531 -0.819004 -0.000141
C  -0.590218 0.177196 -0.000044
C  1.715158 1.43987 -0.000138
C  -1.316027 0.136552 -1.220998
C  -1.315863 0.135218 1.220963
C  1.579745 -2.305225 -0.000021
C  -2.72707 0.053984 -1.221919
C  -2.726904 0.052649 1.221984
C  -3.437504 0.010418 0.000056
H  1.394894 2.480354 -0.000141
H  3.966157 -0.721429 -0.000232
H  -0.766446 0.175891 -2.168511
H  -0.766157 0.173538 2.168446
H  2.535311 -2.859471 -0.001997
H  1.00561 -2.621637 0.889299
H  1.002192 -2.621135 -0.887284
H  -3.270339 0.025618 -2.173431
H  -3.270048 0.023254 2.173536
H  -4.53155 -0.052809 0.000095
