program: Gaussian 09
title: 000139534
version: EM64L-G09RevD.01
frameworkgroup: C1[X(C12H9ClO3S)]
method: RPBEPBE
basis: SDD
operation: Freq
keyword: #p
keyword: freq=noraman
keyword: PBEPBE/SDD
title: #p freq=noraman PBEPBE/SDD
converged: YES YES NO NO
title: Mulliken charges:
elementType: Cl S O O O C C C C C C C C C C C C H H H H H H H H H
charge: -0.028624 0.953340 -0.395173 -0.493875 -0.493161 -0.020080 -0.231490 -0.251174 0.320941 -0.061851 -0.178953 -0.203340 -0.324543 -0.320528 -0.186250 -0.186541 -0.227635 0.306420 0.288781 0.250137 0.266323 0.255579 0.257120 0.234657 0.234983 0.234937
chargesum: 0.00000
title: Mulliken charges with hydrogens summed into heavy atoms:
elementType: Cl S O O O C C C C C C C C C C C C
charge: -0.028624 0.953340 -0.395173 -0.493875 -0.493161 -0.020080 0.074931 0.037607 0.320941 -0.061851 0.071184 0.062983 -0.068964 -0.063408 0.048406 0.048442 0.007302
polarizability: 3.22367591e+02 -1.09517801e+01 1.79072016e+02 -9.12058648e+00 -1.52929253e+01 1.06204993e+02
1716.lowfreq: -5.5916 -4.2672 -0.0023 -0.0019 -0.0012 3.5403 9.7910 23.0279 33.1037
frequency: 4.2330 22.7948 33.1018 37.8144 81.9505 112.4495 157.4531 165.1122 176.9103 191.9983 224.7989 260.6864 324.9994 356.3930 384.7599 394.2571 403.5184 415.9284 426.1550 442.1745 506.9208 538.5461 563.4460 605.8829 637.9613 670.3824 679.9050 717.0914 780.8967 791.4052 810.7460 823.5780 834.2689 892.8154 920.3613 930.2923 942.7259 972.2032 976.5475 985.3205 987.1879 997.0780 1013.7954 1051.8002 1068.8002 1073.3992 1096.3217 1147.3744 1172.3106 1174.2454 1194.2577 1272.0899 1300.5266 1377.8379 1380.3417 1410.1248 1436.7307 1440.9637 1455.6918 1569.4850 1570.4616 1586.1731 1591.3976 3133.7678 3144.8106 3154.6969 3158.7251 3170.7062 3171.1182 3171.7838 3177.7264 3182.5385
redmass: 7.0739 5.0237 6.7319 6.3575 7.2703 12.5269 6.9795 6.3300 9.0142 5.0677 9.4658 9.8611 7.4213 6.6338 7.8516 4.3051 8.0147 4.0212 7.2518 4.0856 4.8021 6.5978 4.7064 6.5846 7.1824 2.6275 1.8065 8.6512 2.0012 1.3342 4.9001 13.6992 1.2489 1.4000 1.3578 1.4773 16.7595 6.4825 1.3821 5.8938 1.3603 1.3400 2.0996 3.8154 1.8550 1.5162 1.7351 1.8257 1.0616 1.0829 1.8415 1.2634 1.3805 7.0880 7.3098 2.8425 2.3257 2.1794 2.1140 6.6430 5.8575 5.8917 7.5145 1.0854 1.0893 1.0876 1.0935 1.0963 1.0932 1.0935 1.1006 1.0997
irintensity: 0.9319 0.2528 1.5685 1.5144 3.9656 2.9402 0.3756 18.4783 1.3380 0.7348 2.3596 7.5656 16.9039 2.7934 17.8537 3.9907 27.2657 3.4798 69.3028 64.8734 17.7257 18.0633 6.2186 0.0646 15.2852 25.3727 38.3166 31.9593 36.0560 50.6689 13.3071 91.4460 0.2915 10.0455 0.7128 6.2844 54.9991 6.5946 0.0590 2.5676 0.3905 0.2846 4.9600 32.8452 17.7532 11.0747 34.8969 19.3772 0.0549 3.8467 0.4369 7.7054 0.0000 9.4097 3.6556 14.3107 7.7112 68.8430 7.0181 41.0225 2.5690 23.1432 28.5809 0.5742 10.8009 4.6407 23.8468 11.2235 0.5429 8.2676 19.5361 10.3057
temp: 298.150 k
press: 1.00000 atm
elementType: 17 16 8 8 8 6 6 6 6 6 6 6 6 6 6 6 6 1 1 1 1 1 1 1 1 1
symmnumber: 1
zpe: 466741.3 jmol-1
zpe.correction: 0.177772 hartree
zpe.thermalcorrener: 0.193922 hartree
zpe.thermalcorrenthalpy: 0.194867 hartree
zpe.thermalcorrgfe: 0.129189 hartree
zpe.sumelectzpe: -1545.085525 hartree
zpe.sumelectthermal: -1545.069375 hartree
zpe.sumelectthermalent: -1545.068430 hartree
zpe.sumelectthermalfe: -1545.134108 hartree
dipole: -0.3754 0.7723 -3.1477
dipole: 3.2627
quadrupole: -87.0310 -106.3063 -122.7102
quadrupole: -11.3078 0.6182 -7.7412
quadrupole: 18.3181 -0.9571 -17.3610 -11.3078 0.6182 -7.7412
hfenergy: -1545.2632969 hartree
pointgroup: C01 [X(C12H9Cl1O3S1)]
dipole: 0.1472241 -0.40037 -1.2107043 debye
dipolederiv: -0.4242928 -0.293406 0.0537774 -0.4846118 -0.5705304 0.0392857 0.0805204 0.0284623 -0.0662257 1.8322344 0.0144598 -0.1123238 -0.08033 0.9572588 -0.0571379 0.121861 -0.1138418 1.3403981 0.2040687 -0.0879077 0.2288373 -0.1557267 -0.2949249 -0.0258505 0.4239821 -0.0272978 -0.3206991 -0.7267194 0.0027514 0.0350521 0.3927379 -0.5993296 0.2158358 -0.2253988 0.1082363 -0.5522612 -0.7605203 -0.012724 0.0005499 -0.2440205 -0.4349817 -0.1826125 -0.3390784 -0.0088461 -0.6479774 0.0217874 0.0002467 -0.0409619 0.0651499 0.0311007 0.0362421 -0.2519762 0.0658047 -0.1857113 -0.4356011 -0.2243077 0.0215801 0.1118592 -0.2359184 -0.0535792 0.1842008 0.0762467 -0.0599828 -0.3670894 0.1115834 0.0347552 -0.2578619 -0.0866906 0.0579542 0.0511273 -0.0636289 -0.0963229 -0.1480408 0.0401179 -0.0946614 0.0131105 0.1446145 0.026479 0.090945 0.0072602 0.0643556 0.538946 0.5710892 -0.0791131 0.7134786 0.8809249 -0.0477569 -0.0888714 -0.0784681 -0.0108665 0.0378725 -0.064598 -0.071104 0.0443336 0.0927668 0.0460331 -0.032677 0.0710045 -0.0668966 -0.0612739 -0.077136 -0.0632849 -0.1549302 -0.2369918 0.0155027 -0.0523931 0.0057054 -0.0595766 0.1724543 -0.1291925 0.0115541 0.2381363 -0.050525 0.1187122 -0.0188165 0.0072409 -0.097587 0.1489215 0.0902573 0.0405022 -0.2478775 -0.0169593 -0.0873551 -0.0980325 0.0396439 -0.1284706 -0.1997489 0.1907715 -0.0195728 0.3538755 0.0055768 0.0890768 0.1242665 0.0228314 -0.1049792 -0.2954754 -0.121196 -0.0986506 -0.3154306 0.1028366 0.0005719 -0.0232202 0.0515647 -0.1225815 0.1339297 -0.0065409 -0.0241812 -0.0051929 0.021397 0.0380176 -0.0252649 0.0371501 -0.1329618 0.1763425 0.0363206 0.0258665 0.0401068 0.09441 -0.0075756 -0.0279375 -0.0307729 0.1367809 0.1422339 -0.0678349 0.0177828 -0.0547169 0.0802007 -0.007291 -0.0297855 0.0232404 0.1438971 0.0152348 0.0385381 0.0564262 0.0443307 -0.0255693 -0.0552509 0.0858025 -0.0566575 0.1219678 -0.0074655 -0.0071452 0.0713795 -0.0187159 0.1100865 -0.002712 0.0650139 -0.0069284 0.1301976 0.0787354 0.0700025 0.025551 0.049659 0.0016364 -0.0370851 -0.0063931 -0.0208645 0.1335569 0.053794 -0.081259 -0.0059038 -0.0526789 0.0281652 -0.0183167 -0.0302453 -0.0321364 0.1322501 -0.0195565 -0.0824584 -0.027788 -0.1229856 -0.0293275 -0.0467775 -0.0085489 -0.0414207 0.1489746 0.0181003 0.070881 0.0069897 0.1048779 -0.0634574 -0.0410334 0.0393417 -0.0508155 0.149331 -0.1288713 0.0186871 0.0069414 0.0234236 0.0942308 -0.0133768 -0.008422 -0.012713 0.1513903 unknown
polarizability: 323.396713|2.9494354|180.5739655|2.5547851|9.2202622|103.6739215 unknown
InChI: InChI=1S/C12H9ClO3S/c13-10-5-4-8-12(9-10)17(14,15)16-11-6-2-1-3-7-11/h1-9H
charge 0 multiplicity 1
26 atoms
Cl 4.694774 2.415492 -0.479969
S  0.130179 -0.393598 1.108234
O  -0.895789 0.009351 -0.587541
O  -0.198701 -1.905002 1.609457
O  -0.005176 0.867362 2.125772
C  1.825344 -0.364756 0.296508
C  2.492517 0.869415 0.236629
C  2.337985 -1.573778 -0.198704
C  -2.271154 0.11423 -0.440091
C  3.765269 0.859122 -0.367083
C  3.61936 -1.536651 -0.795273
C  4.336842 -0.321551 -0.886082
C  -3.090458 -1.031683 -0.650077
C  -2.854598 1.375728 -0.128859
C  -4.491576 -0.900606 -0.58681
C  -4.257148 1.491476 -0.066025
C  -5.076656 0.357493 -0.295208
H  2.049854 1.778647 0.653373
H  1.767929 -2.502731 -0.106131
H  4.061822 -2.45526 -1.19253
H  5.327527 -0.292529 -1.348555
H  -2.610973 -1.99163 -0.866198
H  -2.197847 2.233037 0.049184
H  -5.129701 -1.774173 -0.757863
H  -4.714849 2.459349 0.164753
H  -6.166776 0.452647 -0.241809
