program: Gaussian 09
title: 000139517
version: EM64L-G09RevD.01
frameworkgroup: C1[X(C8H14N2)]
method: RPBEPBE
basis: SDD
operation: Freq
keyword: #pfreq=noraman
keyword: PBEPBE/SDD
title: #p freq=noraman PBEPBE/SDD
converged: YES YES NO NO
title: Mulliken charges:
elementType: N N C C C C C C C C H H H H H H H H H H H H H H
charge: -0.438694 -0.082295 0.023220 0.333601 0.109544 -0.500857 -0.471780 -0.801249 -0.663606 -0.685988 0.206131 0.224299 0.227099 0.201529 0.314715 0.218291 0.230031 0.227373 0.220424 0.217803 0.228339 0.218111 0.214491 0.229469
chargesum: 0.00000
title: Mulliken charges with hydrogens summed into heavy atoms:
elementType: N N C C C C C C C C
charge: -0.123980 -0.082295 0.023220 0.333601 0.109544 -0.070426 -0.043153 -0.125553 0.002961 -0.023917
polarizability: 1.22876645e+02 1.49468436e+00 9.77397479e+01 -2.09307732e-01 -2.73432532e+00 7.05990504e+01
1716.lowfreq: -14.6743 -0.0008 -0.0005 0.0001 7.0133 10.2133 47.7233 51.5864 81.4092
frequency: 46.9283 51.0964 81.3597 108.9042 173.6787 183.3756 201.0485 232.6849 257.7225 286.4361 346.4763 438.5967 451.2990 559.4488 581.0867 665.5567 673.6105 718.2366 729.5665 777.9768 784.0281 931.8855 966.0760 974.5060 1022.4849 1035.7767 1039.8768 1063.2365 1066.7881 1110.6281 1138.0337 1207.6009 1226.2629 1257.7304 1301.4834 1315.3863 1331.5404 1381.4732 1385.5704 1392.6898 1403.0211 1449.0913 1461.3336 1465.8101 1468.9595 1473.7513 1474.4695 1477.9191 1481.6620 1488.3307 1498.5416 1584.9350 2964.2266 2979.2578 2980.8761 2981.9272 2983.8463 3031.9134 3039.6575 3047.7418 3066.9742 3075.9637 3080.8202 3086.9295 3089.2893 3612.5061
redmass: 2.3442 2.3052 3.1315 1.0270 2.8410 1.3708 1.2897 2.9381 1.7399 1.6746 3.6378 4.6613 2.7540 3.4387 1.3781 3.2801 3.4108 3.7185 3.3122 1.3027 1.2413 2.7919 2.1374 1.8214 1.9526 1.5262 1.5481 1.9341 2.0083 2.4027 2.8060 3.1001 1.6192 1.3282 1.4090 1.4673 1.6407 1.2211 1.7775 1.3828 1.2517 3.0116 1.1351 1.1541 1.2948 1.0602 1.0788 1.1261 1.1435 1.1251 1.8933 5.6055 1.0383 1.0419 1.0556 1.0554 1.0407 1.1005 1.0957 1.0972 1.0987 1.0993 1.1002 1.1011 1.1010 1.0817
irintensity: 0.1522 0.1558 0.7756 0.1071 0.5506 0.4582 0.3392 0.9499 0.2007 1.2908 5.6371 0.9877 3.4761 2.0008 74.0275 15.6354 12.8268 0.1902 0.6881 4.7006 0.1380 9.2481 0.8397 23.0048 19.6458 8.4828 6.2189 14.3448 3.5076 5.2860 2.1118 2.7349 6.2759 0.8468 0.9103 0.9000 14.7583 9.1543 5.7732 7.5364 10.3044 9.8196 1.6329 0.5537 9.1745 11.7438 10.5289 20.2314 0.8911 5.1895 35.8154 12.1061 39.0512 40.7465 45.7953 40.2680 25.3671 12.3541 24.4979 2.9463 38.1657 57.4515 45.5946 40.9064 43.2834 54.0577
temp: 298.150 k
press: 1.00000 atm
elementType: 7 7 6 6 6 6 6 6 6 6 1 1 1 1 1 1 1 1 1 1 1 1 1 1
symmnumber: 1
zpe: 545783.7 jmol-1
zpe.correction: 0.207878 hartree
zpe.thermalcorrener: 0.219425 hartree
zpe.thermalcorrenthalpy: 0.220369 hartree
zpe.thermalcorrgfe: 0.170007 hartree
zpe.sumelectzpe: -421.963469 hartree
zpe.sumelectthermal: -421.951923 hartree
zpe.sumelectthermalent: -421.950978 hartree
zpe.sumelectthermalfe: -422.001340 hartree
dipole: -2.4049 1.2310 -0.0827
dipole: 2.7029
quadrupole: -55.4544 -61.2743 -63.5788
quadrupole: 5.8706 -0.2782 -1.0351
quadrupole: 4.6481 -1.1718 -3.4763 5.8706 -0.2782 -1.0351
hfenergy: -422.1713473 hartree
pointgroup: C01 [X(C8H14N2)]
dipole: -0.9554948 -0.4616028 -0.0692297 debye
dipolederiv: -0.3216823 0.2671733 0.0344235 0.3129095 -0.3806376 0.0155423 -0.0144767 0.0322678 -0.2191277 -0.1626314 -0.2797604 -0.0388946 -0.1991455 -0.409363 -0.0119049 -0.0010135 -0.0156458 -0.213639 -0.3407684 0.047151 -0.0011158 -0.0138021 0.0706653 -0.0004771 -0.0059824 0.0347404 -0.1208164 0.1584642 -0.0270047 0.0346615 -0.2197236 0.3163403 -0.0172913 0.0273393 -0.027496 -0.0949343 0.442123 -0.0072062 -0.0294608 0.1094049 0.0690939 -0.0148708 0.0033053 -0.0092329 -0.0906558 0.1367763 -0.0485672 -0.0148967 -0.0366293 0.1228081 -0.0021504 -0.0972611 -0.0099185 0.126484 0.0799761 0.0279672 0.0138578 0.0315581 0.1091449 -0.0402195 0.0659277 -0.0443437 0.1123542 0.0774513 -0.0064154 -0.0035344 -0.0033333 -0.0068979 0.0123749 -0.0014921 -0.0170167 0.1184499 -0.0162977 -0.0066671 -0.0235026 -0.0056626 0.0659237 -0.0311961 0.0299591 -0.0176206 -0.0048276 0.0057079 0.0208018 0.0289893 0.0207279 0.0712365 -0.0325542 -0.0166645 -0.0191291 -0.010757 -0.0374957 0.0549015 0.0253362 0.125765 -0.0811389 -0.1141857 0.0303717 -0.0747339 0.0257534 0.0229118 -0.0200405 -0.015649 -0.0876194 -0.0448973 0.1222421 0.0151734 0.0926036 -0.0306109 -0.0070021 -0.0556927 -0.0202438 -0.1290661 -0.0547743 -0.0821438 -0.0110004 -0.0505902 0.0490739 0.017892 0.0281704 0.0084645 0.088928 -0.0300277 0.1363238 -0.0206749 0.1018095 -0.0723571 0.1529165 0.0190975 0.0053416 -0.0068721 0.2211489 0.0100216 0.005652 -0.0063333 0.3163873 -0.0991752 -0.1340949 0.0898321 -0.0482542 0.0282624 0.0090403 0.0798228 0.0446768 0.0679621 0.1055349 0.023368 0.0308178 0.0238395 -0.0266612 -0.0539524 0.0356987 -0.1263062 -0.1029707 -0.0371661 0.1085775 -0.1177125 0.0482998 0.0297308 0.0183804 -0.108695 0.0655555 0.0249486 0.1030537 -0.0456245 0.0273367 -0.0084992 -0.0582489 0.132648 -0.0023173 0.0820749 -0.0318359 -0.2384893 -0.0680714 -0.0405211 -0.0815265 0.0870546 -0.0136471 -0.0366493 -0.0067528 0.0601424 0.0514657 0.113053 0.0519691 0.0848728 -0.0601479 -0.0816355 0.0332157 -0.0531352 0.038529 0.0432396 -0.1257482 -0.0465296 -0.096616 -0.0907407 -0.0758672 -0.0297998 -0.0480976 0.0445554 -0.2408699 0.0780075 0.0309923 0.0895499 0.0768937 -0.0154997 0.0198371 -0.0115562 0.0665639 0.1040651 0.0366244 -0.0299615 0.0008944 -0.0247679 0.1310221 -0.0002757 0.0841804 -0.0586717 unknown
polarizability: 122.7760006|-2.1036273|97.9529512|1.0455818|1.9174948|70.4864918 unknown
InChI: InChI=1S/C8H14N2/c1-4-7-6(3)8(5-2)10-9-7/h9H,4-5H2,1-3H3
charge 0 multiplicity 1
24 atoms
N  -0.659216 1.592008 0.301283
N  0.729596 1.662527 0.323421
C  -0.011103 -0.541175 0.321476
C  -1.147609 0.292938 0.302984
C  1.121327 0.348031 0.333196
C  -2.619046 -0.027321 0.259965
C  2.587362 -0.003805 0.342457
C  0.007943 -2.048654 0.328785
C  -3.130417 -0.379925 -1.163519
C  3.097454 -0.530876 -1.024942
H  -3.201729 0.826633 0.658817
H  -2.821014 -0.880182 0.936002
H  3.157724 0.89943 0.625341
H  2.782431 -0.76843 1.120937
H  -1.19223 2.458734 0.307845
H  -0.936973 -2.463943 0.724705
H  0.151257 -2.469617 -0.685862
H  0.830968 -2.43483 0.957941
H  -2.968971 0.460391 -1.862259
H  -4.210744 -0.613981 -1.146426
H  -2.593047 -1.257544 -1.564335
H  2.555971 -1.444891 -1.329845
H  4.175233 -0.773029 -0.975811
H  2.949032 0.229811 -1.811753
