program: Gaussian 09
title: 000139499
version: EM64L-G09RevD.01
frameworkgroup: C1[X(C13H19NO3)]
method: RPBEPBE
basis: SDD
operation: Freq
keyword: #p
keyword: freq=noraman
keyword: PBEPBE/SDD
title: #p freq=noraman PBEPBE/SDD
converged: YES YES NO NO
title: Mulliken charges:
elementType: O O O N C C C C C C C C C C C C C H H H H H H H H H H H H H H H H H H H
charge: -0.246972 -0.221573 -0.220690 0.020935 -0.367339 -0.371818 -0.352541 -0.404120 -0.355369 -0.325272 -0.694539 0.363784 -0.309580 -0.343142 -0.361080 -0.334574 0.375643 0.192994 0.194180 0.193438 0.191795 0.188141 0.189220 0.219551 0.218649 0.196386 0.195889 0.217004 0.216096 0.210195 0.217845 0.210111 0.261184 0.263288 0.284433 0.287847
chargesum: 0.00000
title: Mulliken charges with hydrogens summed into heavy atoms:
elementType: O O O N C C C C C C C C C C C C C
charge: -0.246972 -0.221573 -0.220690 0.020935 0.019835 0.013415 0.024820 0.034081 0.036906 0.107829 -0.056387 0.363784 -0.048396 -0.079854 -0.076647 -0.046728 0.375643
polarizability: 2.74965798e+02 5.87855247e+00 1.53352750e+02 -1.59520326e+00 7.78159910e-01 9.36819047e+01
1716.lowfreq: -0.0011 -0.0009 -0.0004 4.3787 6.3635 14.1885 20.1309 34.0900 45.3121
frequency: 19.3014 34.0465 44.4732 51.9561 72.4149 96.3140 99.6984 107.3024 135.0694 146.8905 163.0927 164.2734 189.8609 230.8029 254.2775 298.6944 318.9635 358.4375 420.2333 428.4360 454.2077 495.0997 496.0741 523.5281 622.3616 631.3211 665.4995 723.9838 734.0761 738.9981 757.2414 776.2743 813.1104 818.1141 840.9482 853.8208 890.5187 919.8277 952.3065 976.0232 988.4231 994.2956 1002.7988 1004.0846 1032.6625 1060.9845 1079.0944 1088.8711 1097.0950 1110.7412 1126.6615 1146.0093 1168.6488 1191.2927 1227.0724 1229.6609 1234.4557 1237.5260 1273.9979 1279.7366 1282.6047 1292.4501 1294.4873 1298.7137 1323.8359 1351.7738 1353.0962 1358.8016 1378.8619 1392.4152 1403.2934 1437.7376 1463.3414 1464.5078 1467.9528 1471.3243 1476.7490 1478.3050 1482.2081 1487.1167 1490.5596 1587.1273 1612.8363 2953.3024 2953.8760 2957.8059 2962.4534 2969.8805 2973.1828 2988.8789 2996.6982 2999.0783 3016.1727 3019.2272 3037.2556 3066.1874 3069.6107 3072.3349 3164.8869 3167.5788 3184.3649 3188.9442
redmass: 4.8666 5.0008 1.7456 4.4343 5.5875 2.7782 4.3783 1.9466 3.7783 1.8447 5.0539 2.7248 5.0939 1.1264 4.5591 6.9095 4.3845 4.4121 3.0249 4.4106 3.7146 4.4090 3.1550 4.8176 7.0974 8.0186 4.5368 1.0644 4.8441 1.0913 8.8954 1.1302 7.3177 1.2720 1.1915 1.6357 1.8757 1.1942 7.8193 1.3356 1.3321 2.8943 1.1302 4.3932 3.2372 2.9993 2.1447 2.3518 3.0753 1.2564 2.8637 1.4118 1.4075 1.6090 5.2795 1.2908 1.3510 3.8712 1.2236 1.3048 1.0354 1.2900 1.0798 1.1305 1.3614 2.1172 3.1879 1.6448 1.5264 1.2179 6.5096 4.4538 1.0792 1.0762 1.1562 1.1479 1.2403 1.0492 1.3349 1.1675 1.1459 7.8680 6.5201 1.0590 1.0579 1.0565 1.0590 1.0588 1.0366 1.0974 1.0592 1.1005 1.1038 1.1063 1.1050 1.1054 1.1009 1.0992 1.0884 1.0891 1.0961 1.0973
irintensity: 1.1107 0.7531 0.0020 0.0712 0.2133 0.4954 0.7352 0.0008 2.9798 0.0641 0.7834 5.3325 0.8329 0.0043 1.7893 0.0889 1.2066 0.1540 0.0696 1.5944 0.6063 3.6061 9.0776 1.3833 3.2091 34.2008 23.0916 13.3160 5.2549 0.3287 0.7867 6.1609 20.1185 4.3095 0.5468 72.7526 2.5082 0.1226 112.1265 3.5181 0.2051 1.0994 0.5600 19.0597 0.7693 13.1987 1.1658 23.8176 13.8156 26.2975 11.3206 0.8631 281.7209 0.5084 539.5660 1.3750 0.6508 192.4563 0.1478 3.8143 0.0778 0.2599 0.7778 0.0042 0.0337 26.2750 65.3524 0.8350 13.8634 11.1444 48.2342 12.5223 1.5533 0.3807 27.8968 12.0577 37.3434 13.2965 12.9929 12.7574 17.9247 35.8968 237.4234 1.6343 1.4190 15.5018 20.7493 122.6240 37.2986 0.5636 36.1556 1.4530 9.6483 8.9602 64.2755 55.7181 121.6597 53.1218 5.9631 1.2828 2.5522 4.8428
temp: 298.150 k
press: 1.00000 atm
elementType: 8 8 8 7 6 6 6 6 6 6 6 6 6 6 6 6 6 1 1 1 1 1 1 1 1 1 1 1 1 1 1 1 1 1 1 1
symmnumber: 1
zpe: 785251.5 jmol-1
zpe.correction: 0.299087 hartree
zpe.thermalcorrener: 0.317159 hartree
zpe.thermalcorrenthalpy: 0.318104 hartree
zpe.thermalcorrgfe: 0.250263 hartree
zpe.sumelectzpe: -785.811895 hartree
zpe.sumelectthermal: -785.793822 hartree
zpe.sumelectthermalent: -785.792878 hartree
zpe.sumelectthermalfe: -785.860718 hartree
dipole: -7.8136 -0.0605 0.1071
dipole: 7.8146
quadrupole: -150.9749 -101.2084 -102.7611
quadrupole: -7.2144 0.3443 0.1870
quadrupole: -32.6601 17.1064 15.5537 -7.2144 0.3443 0.1870
hfenergy: -786.1109814 hartree
pointgroup: C01 [X(C13H19N1O3)]
dipole: 3.0699377 0.0413439 -0.1620964 debye
polarizability: 274.5973368|-2.446388|148.7267489|-10.0824845|15.8006214|98.676367 unknown
InChI: InChI=1S/C13H19NO3/c1-2-3-4-5-6-11-17-13-9-7-12(8-10-13)14(15)16/h7-10H,2-6,11H2,1H3
charge 0 multiplicity 1
36 atoms
O  -0.112069 -0.900544 -0.243622
O  -5.944653 1.512981 0.789959
O  -6.445592 -0.639336 0.214888
N  -5.600467 0.317128 0.431511
C  4.850164 -0.349872 -0.262633
C  3.491943 0.350134 -0.029509
C  6.062881 0.575983 -0.018893
C  2.290867 -0.597034 -0.258013
C  7.420221 -0.128821 -0.245009
C  0.954846 0.103818 -0.011302
C  8.629374 0.79559 0.013469
C  -1.435778 -0.521043 -0.05972
C  -1.853324 0.781447 0.331707
C  -2.398592 -1.542779 -0.290946
C  -3.223883 1.052898 0.491822
C  -3.763477 -1.272898 -0.131727
C  -4.167005 0.027918 0.260734
H  4.924537 -1.233812 0.404439
H  4.888216 -0.73954 -1.301123
H  3.412879 1.227123 -0.705376
H  3.46179 0.748376 1.00633
H  6.024312 0.967851 1.019222
H  5.994307 1.459574 -0.687589
H  2.307497 -0.986628 -1.293717
H  2.366449 -1.470941 0.416806
H  7.462296 -0.513427 -1.284525
H  7.483318 -1.016384 0.417304
H  0.811518 0.95463 -0.70838
H  0.883914 0.475302 1.031551
H  8.60692 1.675836 -0.656601
H  9.585959 0.267797 -0.155105
H  8.628339 1.168057 1.055366
H  -1.126295 1.577662 0.510314
H  -2.045575 -2.53315 -0.591682
H  -3.576687 2.043121 0.792063
H  -4.52275 -2.040316 -0.302114
