program: Gaussian 09
title: 000139496
version: EM64L-G09RevD.01
frameworkgroup: C1[X(Br2ClP)]
method: RPBEPBE
basis: SDD
operation: Freq
keyword: #pfreq=noraman
keyword: PBEPBE/SDD
title: #p freq=noraman PBEPBE/SDD
converged: NO NO NO NO
title: Mulliken charges:
elementType: Br Br Cl P
charge: -0.055814 -0.055815 -0.163866 0.275495
chargesum: 0.00000
title: Mulliken charges with hydrogens summed into heavy atoms:
polarizability: 9.86413905e+01 -1.54513424e-04 7.80832968e+01 5.58011232e-05 1.57406188e+00 3.53780467e+01
1716.lowfreq: -8.2097 -7.1678 -0.0016 -0.0015 -0.0004 7.6933 92.8631 107.5086 144.8277
frequency: 92.8631 107.4964 144.8248 320.8040 323.4711 404.7237
redmass: 61.0141 44.3306 41.6339 36.4441 35.5890 32.6299
irintensity: 0.0159 0.0370 0.8901 33.1463 105.3105 72.8983
temp: 298.150 k
press: 1.00000 atm
elementType: 35 35 17 15
symmnumber: 1
zpe: 8339.1 jmol-1
zpe.correction: 0.003176 hartree
zpe.thermalcorrener: 0.009221 hartree
zpe.thermalcorrenthalpy: 0.010165 hartree
zpe.thermalcorrgfe: -0.030526 hartree
zpe.sumelectzpe: -827.927791 hartree
zpe.sumelectthermal: -827.921746 hartree
zpe.sumelectthermalent: -827.920802 hartree
zpe.sumelectthermalfe: -827.961493 hartree
dipole: 0.0000 -0.2983 1.3614
dipole: 1.3936
quadrupole: -58.0162 -59.1432 -55.6258
quadrupole: 0.0000 0.0000 1.2130
quadrupole: -0.4212 -1.5481 1.9693 0.0000 0.0000 1.2130
hfenergy: -827.9309669 hartree
pointgroup: C01 [X(Br2Cl1P1)]
dipole: 0.0000535 0.1437321 -0.5291282 debye
dipolederiv: -0.741476 -0.3219372 -0.1379664 -0.3718939 -0.2801111 -0.0725836 -0.3756669 -0.1834333 -0.1829615 -0.7410432 0.3222242 0.1379183 0.3721758 -0.2805428 -0.0726672 0.3755501 -0.1836659 -0.18296 -0.1544486 -0.0002241 0.0000346 -0.0002191 -0.8552727 0.1083325 0.0001246 0.3948041 -0.221243 1.6369678 -0.0000629 0.0000135 -0.0000628 1.4159266 0.0369182 -0.0000078 -0.0277049 0.5871645 unknown
polarizability: 98.6413887|-0.0061854|77.8227121|0.0011325|3.6794263|35.6386332 unknown
InChI: InChI=1S/2Br.Cl.P
charge 0 multiplicity 1
4 atoms
Br 1.880835 1.050183 0.255068
Br -1.880176 1.05135 0.255064
Cl -0.000649 -2.050845 0.267978
P  -0.00001 -0.050688 -0.77811
