program: Gaussian 09
title: 000139495
version: EM64L-G09RevD.01
frameworkgroup: C1[X(C15H16)]
method: RPBEPBE
basis: SDD
operation: Freq
keyword: #p
keyword: freq=noraman
keyword: PBEPBE/SDD
title: #p freq=noraman PBEPBE/SDD
converged: YES YES NO NO
title: Mulliken charges:
elementType: C C C C C C C C C C C C C C C H H H H H H H H H H H H H H H H
charge: 0.270921 -0.640260 0.310732 0.459624 -0.501465 0.454758 -0.415293 -0.441152 -0.812670 -0.400061 -0.403245 -0.818883 -0.233192 -0.233427 -0.242589 0.219221 0.216719 0.250129 0.226308 0.228583 0.223084 0.223240 0.229100 0.237344 0.237732 0.220205 0.229628 0.229276 0.224466 0.224582 0.226585
chargesum: 0.00000
title: Mulliken charges with hydrogens summed into heavy atoms:
elementType: C C C C C C C C C C C C C C C
charge: 0.270921 -0.204320 0.310732 0.459624 -0.251336 0.454758 -0.188985 -0.212570 -0.137246 -0.162717 -0.165513 -0.139775 -0.008726 -0.008845 -0.016004
polarizability: 1.94198615e+02 1.74235374e+01 1.54338797e+02 -4.38083907e-01 -2.85742481e-01 1.16955805e+02
1716.lowfreq: -14.6879 -0.0004 0.0003 0.0006 2.7663 7.4561 12.3392 26.9896 30.3939
frequency: -6.8936 26.7195 30.2972 62.5469 120.9905 150.6754 173.2789 188.0744 229.6527 302.6127 311.2856 322.5893 403.4378 433.6506 434.2070 444.2627 475.4036 539.3314 566.9222 605.6348 617.8809 702.8991 706.1486 711.7285 741.6318 783.4254 815.9079 827.1995 853.2770 884.4757 914.2481 926.4521 933.4089 955.3440 974.6045 989.6608 991.3446 993.1568 1010.0165 1027.5643 1039.7659 1048.3930 1080.7056 1102.3304 1161.9406 1170.7743 1184.4557 1187.5205 1213.1046 1220.8382 1249.3211 1282.6050 1303.5991 1327.0260 1368.7804 1382.4831 1395.7577 1398.6297 1412.2264 1439.4698 1457.1650 1468.5291 1469.8371 1472.3730 1481.0947 1484.8521 1495.0132 1585.2672 1593.1364 1615.2233 1626.1426 2959.1258 2963.6507 2974.1436 3002.8976 3033.5620 3051.9835 3080.5399 3081.1867 3111.0605 3116.2853 3117.3300 3127.4128 3132.0531 3137.7408 3143.4761 3161.5393
redmass: 3.5359 2.2805 1.2416 4.4491 1.9076 1.2448 3.3966 4.0436 3.9345 2.8078 2.7791 2.2623 2.8096 2.8992 2.9332 4.2654 3.9924 2.9853 4.7341 4.2579 6.3235 2.4562 2.8583 2.9827 2.3654 3.0829 1.2531 3.6635 1.2496 1.4027 1.9505 1.8825 1.5571 1.4567 1.3894 3.9847 1.8031 1.4586 1.3814 2.2023 1.5483 1.5533 1.5851 2.7411 1.4066 1.0573 1.1151 1.1236 1.9288 2.0670 2.8966 1.8499 1.5585 1.2648 4.2811 7.9034 1.2691 1.2700 2.8178 2.1698 1.1494 1.0510 1.0459 1.0927 1.1069 2.3181 3.1212 5.6792 6.0453 6.1616 6.5122 1.0597 1.0384 1.0370 1.0991 1.0968 1.0976 1.0987 1.0975 1.0871 1.0853 1.0880 1.0907 1.0913 1.0966 1.0961 1.1016
irintensity: 0.0040 0.1117 0.3056 0.1305 1.2531 0.0004 3.7531 0.9261 0.3178 1.0718 0.7025 0.4991 0.0014 2.9588 2.3065 0.7693 4.9830 5.8246 6.4785 7.5415 0.2014 26.0665 25.2238 0.5570 29.8500 14.5363 33.9376 6.4248 0.0720 0.0198 0.2844 6.3532 2.0491 0.7138 0.0194 1.2552 2.4483 4.5734 5.1847 6.6566 3.8487 14.0953 10.3535 4.4528 6.6648 0.0094 0.7299 0.5452 1.6748 2.7109 2.1698 0.6688 1.2587 0.1655 0.3557 0.0427 18.4211 0.3314 5.6665 8.4450 16.8094 9.8313 17.9728 0.4686 36.2761 13.3244 26.6810 5.5890 1.3491 9.0889 10.7581 33.9750 39.1347 35.0803 15.1033 21.4288 21.2545 15.5444 36.1213 16.3624 8.9553 2.5273 14.7823 11.5436 32.2124 43.8926 24.1295
temp: 298.150 k
press: 1.00000 atm
elementType: 6 6 6 6 6 6 6 6 6 6 6 6 6 6 6 1 1 1 1 1 1 1 1 1 1 1 1 1 1 1 1
symmnumber: 1
zpe: 682435.4 jmol-1
zpe.correction: 0.259926 hartree
zpe.thermalcorrener: 0.273190 hartree
zpe.thermalcorrenthalpy: 0.274134 hartree
zpe.thermalcorrgfe: 0.218629 hartree
zpe.sumelectzpe: -580.137481 hartree
zpe.sumelectthermal: -580.124217 hartree
zpe.sumelectthermalent: -580.123273 hartree
zpe.sumelectthermalfe: -580.178778 hartree
dipole: 0.1667 -0.2003 -0.0070
dipole: 0.2606
quadrupole: -84.4693 -84.8770 -87.5191
quadrupole: 4.0434 -0.0533 -0.0903
quadrupole: 1.1525 0.7448 -1.8973 4.0434 -0.0533 -0.0903
hfenergy: -580.3974071 hartree
pointgroup: C01 [X(C15H16)]
dipole: 0.0760427 -0.068458 -0.0067175 debye
polarizability: 188.5356156|22.0975738|159.6444053|3.1794208|3.7887811|117.3131966 unknown
InChI: InChI=1S/C15H16/c1-12-8-9-13(2)15(10-12)11-14-6-4-3-5-7-14/h3-10H,11H2,1-2H3
charge 0 multiplicity 1
31 atoms
C  -0.894416 -0.699159 -0.103853
C  0.471555 -1.398893 -0.159546
C  -2.082904 -1.492834 -0.176898
C  1.689317 -0.497745 -0.025623
C  -1.005366 0.704835 0.01244
C  -2.262828 1.361653 0.060197
C  -3.335496 -0.837856 -0.128813
C  -3.430952 0.56791 -0.011776
C  -2.015361 -3.005317 -0.303584
C  2.230756 -0.194064 1.250104
C  2.30647 0.067302 -1.171134
C  -2.340835 2.874321 0.184509
C  3.358655 0.647705 1.379877
C  3.434577 0.91022 -1.04832
C  3.965649 1.203202 0.229345
H  0.536417 -1.96024 -1.114547
H  0.499764 -2.170638 0.636603
H  -0.090403 1.306293 0.067234
H  -4.252004 -1.438393 -0.183967
H  -4.417286 1.046371 0.023106
H  -1.466957 -3.318838 -1.213372
H  -1.491995 -3.468168 0.556069
H  -3.026785 -3.443122 -0.35488
H  1.763644 -0.620905 2.146339
H  1.898848 -0.155815 -2.164994
H  -3.387597 3.224148 0.202335
H  -1.850467 3.228311 1.11105
H  -1.83205 3.374784 -0.661027
H  3.76475 0.866486 2.374122
H  3.899625 1.333662 -1.945945
H  4.842676 1.852984 0.326948
