program: Gaussian 09
title: 000134516
version: EM64L-G09RevD.01
frameworkgroup: C1[X(C12H13Cl4O4P)]
method: RPBEPBE
basis: SDD
operation: Freq
keyword: #p
keyword: freq=noraman
keyword: PBEPBE/SDD
title: #p freq=noraman PBEPBE/SDD
converged: YES YES NO NO
title: Mulliken charges:
elementType: Cl Cl Cl Cl P O O O O C C C C C C C C C C C C H H H H H H H H H H H H H
charge: -0.032590 -0.045334 0.061142 0.046666 1.395257 -0.533803 -0.524218 -0.496778 -0.574357 0.327080 0.588806 -0.236093 -0.219792 -0.365729 -0.303550 -0.073893 -0.070961 -0.647449 -0.657801 -0.224833 -0.605795 0.226867 0.247242 0.227694 0.245247 0.290060 0.292467 0.217259 0.241513 0.234573 0.212201 0.239061 0.233482 0.286357
chargesum: 0.00000
title: Mulliken charges with hydrogens summed into heavy atoms:
elementType: Cl Cl Cl Cl P O O O O C C C C C C C C C C C C
charge: -0.032590 -0.045334 0.061142 0.046666 1.395257 -0.533803 -0.524218 -0.496778 -0.574357 0.327080 0.588806 0.238016 0.253149 -0.075669 -0.011083 -0.073893 -0.070961 0.045897 0.026943 0.061524 -0.605795
polarizability: 2.63037476e+02 -1.24531210e+01 2.22652613e+02 2.44361176e+01 1.64631126e+01 1.59990526e+02
1716.lowfreq: -29.0270 -5.8805 -3.1216 0.0004 0.0021 0.0021 3.9350 7.1146 22.1701
frequency: -28.2781 6.6389 22.0835 25.2729 36.0765 41.9548 53.7618 55.5139 62.9459 85.6928 108.7273 119.7553 149.2957 159.1811 178.3094 180.1012 200.6341 207.6668 223.8061 237.0443 242.7010 251.4387 258.9648 286.8475 318.7467 325.7233 338.7305 373.1463 383.5058 390.2299 408.0661 420.4133 431.4373 495.1495 515.3640 520.2444 598.1466 635.2669 652.4821 663.7960 695.3300 709.5432 757.3832 806.5366 808.2179 839.0274 863.8089 867.3969 879.9681 894.5172 904.2307 908.2110 979.9123 1004.8871 1010.7497 1062.0936 1069.2715 1097.5711 1098.9761 1107.1225 1112.7414 1131.3345 1140.7221 1247.7664 1250.2350 1261.7128 1264.1436 1353.5747 1356.6843 1370.4209 1391.9143 1396.1135 1404.3592 1430.9477 1457.0906 1457.4991 1476.0523 1478.3684 1485.1314 1488.4961 1557.0066 1593.9199 1613.1479 2992.6668 2996.6504 3006.9903 3010.8297 3073.0496 3080.5596 3088.9491 3093.7899 3110.1067 3116.2581 3182.2409 3185.1274 3186.8777
redmass: 2.5965 4.9927 9.1571 2.6734 4.2393 5.2735 3.9157 18.8477 3.7274 8.9719 5.3329 7.3978 9.9869 9.3996 7.6678 5.8054 3.4778 4.3105 5.3050 1.4144 1.8317 6.7020 3.0960 7.4076 8.7840 5.6396 8.9424 7.4438 6.9913 9.4741 7.6840 9.0362 6.7345 7.4456 5.5180 7.4017 6.7802 6.9393 5.6250 8.6087 3.7858 5.2594 11.0738 1.1256 1.0897 8.0448 3.7775 1.5071 5.1067 2.8437 1.7794 1.8203 6.2414 2.4182 2.4892 10.8920 6.0630 2.2546 1.5311 2.3287 2.0281 1.4025 1.5024 3.7322 1.1667 1.2181 1.1461 1.2497 1.2263 8.5876 1.2406 1.2417 3.0880 3.2360 1.0393 1.0414 1.0586 1.0536 1.0734 1.0830 6.9383 7.3309 11.7479 1.0359 1.0361 1.0579 1.0584 1.1076 1.1064 1.0977 1.0976 1.1035 1.1033 1.0927 1.0931 1.0943
irintensity: 0.3669 0.6310 0.1185 0.6538 0.4535 1.3010 3.0152 0.1452 1.7786 1.3838 0.4513 1.3209 0.5192 0.6323 1.6536 1.6347 2.0984 0.9226 3.2625 2.7524 1.2733 2.4561 10.6370 6.7537 19.0199 4.6747 1.5430 9.5668 16.6572 14.7462 5.6770 47.1712 4.7806 19.2501 3.5585 18.0077 13.7699 48.1703 73.6654 70.6156 46.2707 93.6188 85.5814 9.5787 2.4901 12.1681 101.9508 46.1495 277.1646 71.1611 83.1629 96.3109 5.5221 160.2245 74.7507 138.4631 42.2676 11.1776 20.7028 25.2477 11.6048 4.9089 6.2790 99.6938 0.1713 1.8449 0.8570 2.0761 5.1653 3.5001 16.5883 26.8030 59.6157 10.5105 12.1784 10.2245 2.5355 8.5046 11.1323 13.8433 110.7387 52.6902 12.6002 12.3597 19.0693 32.6452 15.2872 3.6239 3.7300 28.3692 20.6567 32.0075 34.9446 0.5806 1.9342 0.9462
temp: 298.150 k
press: 1.00000 atm
elementType: 17 17 17 17 15 8 8 8 8 6 6 6 6 6 6 6 6 6 6 6 6 1 1 1 1 1 1 1 1 1 1 1 1 1
symmnumber: 1
zpe: 603355.1 jmol-1
zpe.correction: 0.229806 hartree
zpe.thermalcorrener: 0.253759 hartree
zpe.thermalcorrenthalpy: 0.254703 hartree
zpe.thermalcorrgfe: 0.170891 hartree
zpe.sumelectzpe: -2945.804439 hartree
zpe.sumelectthermal: -2945.780486 hartree
zpe.sumelectthermalent: -2945.779542 hartree
zpe.sumelectthermalfe: -2945.863354 hartree
dipole: -2.6844 2.1399 2.1844
dipole: 4.0690
quadrupole: -144.1297 -173.1231 -148.8617
quadrupole: -1.2204 -1.7803 0.8259
quadrupole: 11.2418 -17.7516 6.5098 -1.2204 -1.7803 0.8259
hfenergy: -2946.0342453 hartree
pointgroup: C01 [X(C12H13Cl4O4P1)]
dipole: 1.2449575 -0.1896951 -0.9883469 debye
polarizability: 245.8747205|48.1097697|174.9149652|4.2735814|-7.5882933|224.8909295 unknown
InChI: InChI=1S/C12H13Cl4O4P/c1-3-18-21(17,19-4-2)20-11(12(15)16)8-5-9(13)7-10(14)6-8/h5-7H,3-4H2,1-2H3
charge 0 multiplicity 1
34 atoms
Cl -3.502992 -0.441613 2.989573
Cl -3.949818 -1.853487 -2.359485
Cl 2.066005 2.570877 -1.799313
Cl -0.740045 2.318148 -2.865457
P  1.810916 -0.606054 1.0049
O  1.111344 0.941311 0.482098
O  2.254218 -1.243937 -0.535864
O  3.209853 0.003027 1.760795
O  0.949962 -1.546361 1.939609
C  -1.148133 0.320417 -0.287152
C  0.136006 1.024727 -0.537529
C  2.140823 -2.722508 -0.787665
C  4.15771 0.908058 1.019641
C  -1.85344 -0.337041 -1.330504
C  -1.645904 0.27309 1.043373
C  -2.852146 -0.400746 1.294715
C  -3.051013 -1.003651 -1.02348
C  1.439968 -2.911292 -2.129866
C  5.303015 1.174884 1.988686
C  -3.58228 -1.051367 0.280047
C  0.444004 1.82363 -1.602065
H  3.174502 -3.109828 -0.8031
H  1.581783 -3.191298 0.043376
H  4.493227 0.388887 0.102964
H  3.610946 1.825817 0.742599
H  -1.471452 -0.33542 -2.353701
H  -1.098369 0.755363 1.856455
H  1.42103 -3.986223 -2.39016
H  0.399983 -2.545906 -2.08825
H  1.97477 -2.371275 -2.929649
H  6.042017 1.845733 1.512347
H  4.931273 1.659637 2.906732
H  5.80976 0.235943 2.267733
H  -4.515526 -1.576339 0.496596
