program: Gaussian 09
title: 000134507
version: EM64L-G09RevD.01
frameworkgroup: C1[X(C13H14N2O6)]
method: RPBEPBE
basis: SDD
operation: Freq
keyword: #p
keyword: freq=noraman
keyword: PBEPBE/SDD
title: #p freq=noraman PBEPBE/SDD
converged: YES YES NO NO
title: Mulliken charges:
elementType: O O O O O O N N C C C C C C C C C C C C C H H H H H H H H H H H H H H
charge: -0.275475 -0.266924 -0.413575 -0.242737 -0.437185 -0.239943 -0.379494 -0.601817 -0.199208 -0.372175 -0.467399 0.215680 0.129198 0.227918 0.168247 0.090313 -0.374519 -0.316939 -0.220032 -0.220990 0.094248 0.282971 0.227639 0.233652 0.296996 0.257726 0.348387 0.261833 0.341171 0.328800 0.280949 0.238627 0.238837 0.377103 0.388114
chargesum: 0.00000
title: Mulliken charges with hydrogens summed into heavy atoms:
elementType: O O O O O O N N C C C C C C C C C C C C C
charge: -0.275475 -0.266924 -0.036472 -0.242737 -0.049071 -0.239943 -0.031107 0.068154 0.083763 0.089116 0.087323 0.215680 0.129198 0.227918 0.168247 0.090313 -0.112686 -0.035990 0.018595 0.017847 0.094248
polarizability: 2.11601937e+02 1.04249761e+01 2.00830753e+02 2.20364628e+01 9.59630577e+00 1.05941643e+02
1716.lowfreq: -7.5822 -3.4312 0.0008 0.0008 0.0010 2.7066 13.3290 21.2030 29.2049
frequency: 13.0091 21.0431 29.1673 44.9495 49.5615 62.0033 72.2661 80.6897 105.1161 120.2910 130.6565 138.6073 190.0594 202.9741 228.3794 247.3254 290.9265 302.3393 336.6850 379.8355 410.1802 419.6768 433.9569 471.6103 508.2114 513.6246 516.7030 562.3802 569.0276 590.3108 595.5817 598.0814 609.8518 647.8651 651.4599 683.9037 699.8924 708.5955 722.6029 752.5732 776.7542 791.2069 800.4915 817.1650 870.5809 898.9512 917.4850 937.2640 977.3309 1002.4427 1005.7933 1035.3717 1042.1501 1052.0175 1059.7404 1087.5569 1100.2099 1115.1440 1156.7479 1160.7337 1178.9944 1179.3415 1219.7862 1248.9922 1264.7295 1279.0521 1287.1075 1313.3467 1315.6906 1340.2413 1367.9708 1378.1050 1379.1290 1427.6438 1438.8261 1460.5936 1470.6544 1488.1304 1572.7947 1582.0829 1599.1036 1604.8306 1637.7110 1648.3095 1660.1058 2993.1368 2999.1073 3002.2442 3053.9677 3079.3364 3137.5000 3152.1526 3166.3150 3183.9662 3443.4705 3510.1402 3519.2816 3531.9939 3670.8812
redmass: 6.7417 7.3811 10.5112 5.8971 6.0504 5.4215 5.1212 6.3251 6.5842 2.4893 6.6005 5.2056 5.6746 4.8422 5.9649 6.0594 6.0593 7.1490 6.3924 6.4508 3.2558 3.8331 3.4188 3.3821 1.7733 2.7870 1.6837 3.0573 2.1176 1.2546 2.0977 3.2991 4.3505 3.4934 1.6162 4.2165 2.0073 4.2307 1.7889 5.2447 2.5630 1.9166 1.9691 3.9411 4.2584 1.4580 2.4889 2.9436 1.4023 4.5301 1.4147 3.0347 2.8641 2.1830 2.2832 2.9119 2.4806 2.0890 1.7890 1.7609 1.1830 1.5273 1.2858 1.4765 1.6387 1.2144 1.6512 1.7077 2.5401 1.3042 2.7879 2.0675 9.8016 2.1287 1.0995 1.3401 1.6578 2.4899 7.2284 6.0761 1.6593 6.1317 7.9434 3.0730 7.8111 1.0666 1.0780 1.0654 1.0990 1.0973 1.0863 1.0913 1.0973 1.0969 1.0771 1.0639 1.0451 1.0642 1.1044
irintensity: 0.0356 0.3442 1.7167 8.2305 2.9766 5.1967 1.0557 1.4242 6.8788 1.2991 6.3892 0.2405 1.8835 15.3967 4.5670 1.0803 3.6581 4.8226 7.1046 9.5152 8.1784 18.5551 20.8226 10.3015 53.7977 5.1096 66.2775 15.0345 191.8568 84.0077 51.3586 29.6225 6.4860 28.1080 106.1037 33.8007 14.9863 117.4514 76.9044 2.9537 20.4683 29.9659 17.2529 6.3476 6.5112 0.4655 25.6356 11.1374 4.4438 237.5732 14.1216 40.1004 93.3554 29.1056 61.4608 47.5435 44.6450 22.0726 5.1430 84.9945 5.2419 10.9216 15.0638 1.1429 19.3393 17.1494 6.4786 48.9686 89.6728 15.2074 196.9353 80.2406 8.7145 2.4524 26.9500 196.4194 38.9753 181.6009 79.5985 179.1092 37.8877 11.3950 351.4399 122.9534 247.1051 20.9013 12.8345 7.8786 8.2508 19.9149 1.6418 10.3279 14.7946 8.3576 94.3299 20.6081 46.6177 50.7091 30.0799
temp: 298.150 k
press: 1.00000 atm
elementType: 8 8 8 8 8 8 7 7 6 6 6 6 6 6 6 6 6 6 6 6 6 1 1 1 1 1 1 1 1 1 1 1 1 1 1
symmnumber: 1
zpe: 688474.1 jmol-1
zpe.correction: 0.262226 hartree
zpe.thermalcorrener: 0.282917 hartree
zpe.thermalcorrenthalpy: 0.283861 hartree
zpe.thermalcorrgfe: 0.208738 hartree
zpe.sumelectzpe: -1063.141959 hartree
zpe.sumelectthermal: -1063.121268 hartree
zpe.sumelectthermalent: -1063.120323 hartree
zpe.sumelectthermalfe: -1063.195447 hartree
dipole: -0.8973 0.6608 -0.8993
dipole: 1.4320
quadrupole: -108.3464 -97.8450 -131.3033
quadrupole: 4.9736 4.7564 12.0670
quadrupole: 4.1518 14.6532 -18.8050 4.9736 4.7564 12.0670
hfenergy: -1063.4041849 hartree
pointgroup: C01 [X(C13H14N2O6)]
dipole: 0.3396699 -0.2094862 -0.3976587 debye
polarizability: 209.1671062|13.2216489|202.1914044|-25.1800969|1.1012597|107.0158229 unknown
InChI: InChI=1S/C13H14N2O6/c14-11(18)9(5-6-10(16)17)15-12(19)7-3-1-2-4-8(7)13(20)21/h1-4,9,15-16,20H,5-6,14H2
charge 0 multiplicity 1
35 atoms
O  -0.559946 -2.541752 -1.660632
O  -0.275342 0.794115 1.823392
O  -4.677795 2.700422 0.541776
O  -5.558386 0.570885 0.280539
O  3.902581 -1.780866 -0.241086
O  1.878856 -1.818652 0.886264
N  -0.387466 -0.278776 -0.243731
N  -2.092752 -3.522079 -0.218248
C  -1.528119 -1.132117 0.110587
C  -2.9083 -0.50693 -0.24684
C  -3.102007 0.884918 0.387118
C  -1.338559 -2.460256 -0.662139
C  0.24459 0.503615 0.699237
C  1.575322 1.091055 0.270436
C  -4.553801 1.312027 0.383047
C  2.745109 0.311489 0.020084
C  1.645523 2.498271 0.141338
C  3.942023 0.954843 -0.395404
C  2.839864 3.129796 -0.267066
C  3.989511 2.354283 -0.546165
C  2.752351 -1.159346 0.272966
H  -1.485978 -1.308867 1.203548
H  -3.717259 -1.177159 0.100098
H  -3.004829 -0.436645 -1.346808
H  -2.741378 0.887607 1.43528
H  -2.497699 1.652423 -0.125588
H  0.106562 -0.576025 -1.096517
H  0.753694 3.091879 0.366477
H  -2.027407 -4.411399 -0.7133
H  -2.688675 -3.455294 0.605106
H  4.827536 0.341735 -0.580925
H  2.873046 4.220027 -0.366901
H  4.918014 2.838836 -0.865452
H  -5.644472 2.938417 0.577262
H  3.856288 -2.75198 -0.031154
