program: Gaussian 09
title: 000011128
version: EM64L-G09RevD.01
frameworkgroup: C1[X(C10H17NO6)]
method: RPBEPBE
basis: SDD
operation: Freq
keyword: #p
keyword: freq=noraman
keyword: PBEPBE/SDD
title: #p freq=noraman PBEPBE/SDD
converged: YES YES NO NO
title: Mulliken charges:
elementType: O O O O O O N C C C C C C C C C C H H H H H H H H H H H H H H H H H
charge: -0.235948 -0.246081 -0.454919 -0.451209 -0.452221 -0.416718 -0.010850 -0.149313 -0.287161 -0.092214 -0.018199 -0.006526 -0.398655 0.275125 -0.658291 -0.692724 -0.178293 0.200774 0.327908 0.251215 0.202857 0.189972 0.190811 0.262510 0.362886 0.340053 0.368705 0.247037 0.234845 0.219683 0.239274 0.252405 0.215674 0.367588
chargesum: 0.00000
title: Mulliken charges with hydrogens summed into heavy atoms:
elementType: O O O O O O N C C C C C C C C C C
charge: -0.235948 -0.246081 -0.092033 -0.111156 -0.083516 -0.049130 -0.010850 0.051461 0.040747 0.159001 0.184657 0.183446 0.054665 0.275125 0.043273 0.014629 -0.178293
polarizability: 1.53804171e+02 -2.09622680e+00 1.35081128e+02 -3.30248334e+00 6.94563280e+00 1.07526141e+02
1716.lowfreq: -0.0007 -0.0006 -0.0002 3.6732 7.8764 18.8090 27.9856 42.6732 50.3577
frequency: 27.3365 42.6508 50.3176 75.4109 94.0935 112.7962 140.9386 168.8691 184.8825 192.6602 196.1129 216.7380 223.9071 237.7876 266.3394 272.1318 294.5934 301.3137 349.9441 361.3851 379.2048 398.7017 407.2505 421.5530 435.8232 455.2393 498.5117 531.8515 545.9868 559.7983 573.7018 577.6707 616.0117 667.3436 696.2251 818.8798 859.1135 896.5642 927.9649 928.3350 937.0928 948.5059 973.5485 1002.2289 1009.1712 1018.7958 1035.6155 1052.6484 1063.3472 1082.4975 1103.5119 1128.8613 1146.2515 1177.9540 1187.2632 1191.4632 1207.4494 1215.2781 1229.2970 1248.6564 1268.7553 1288.8353 1321.3180 1333.0960 1340.4998 1350.4075 1354.9856 1372.6366 1379.0532 1386.8618 1389.6747 1396.2720 1403.9885 1450.2973 1458.0545 1459.0772 1468.2496 1480.1480 2181.1781 2887.7361 2909.5161 2924.0959 2976.4474 3000.5776 3007.0774 3010.7187 3099.4372 3100.0926 3102.6745 3110.9111 3116.1479 3122.8043 3504.5123 3529.0631 3548.0459 3556.0231
redmass: 5.9550 4.9883 4.8490 5.3736 4.7186 7.3439 7.1717 3.0047 4.7171 2.8071 1.1393 3.7209 4.5915 1.1842 3.6386 4.0520 3.5043 4.6000 1.3060 2.5336 3.6840 1.2889 4.7671 3.2609 2.1770 1.7000 5.4044 3.9051 3.6466 5.2969 4.3365 1.2625 4.2413 3.1466 4.3998 3.1129 3.1679 4.5675 2.1383 4.7552 1.6866 5.9187 4.7949 3.7801 1.3321 2.9833 2.9602 2.7563 3.3523 3.5240 3.4618 2.5352 1.9625 1.4449 1.4199 2.6027 1.2561 1.3483 2.0895 1.2471 1.1458 1.2199 1.2262 1.3236 1.4596 1.3150 1.2449 1.5584 1.2049 1.1912 1.2201 1.1931 1.5417 1.0476 1.0470 1.0724 1.0557 1.0500 12.6566 1.0822 1.0820 1.0825 1.0695 1.0347 1.0347 1.0850 1.0913 1.0898 1.1006 1.1010 1.1007 1.1014 1.0659 1.0658 1.0657 1.0657
irintensity: 0.8445 5.0758 4.4552 9.3344 1.3464 0.2305 1.3153 0.4629 1.2522 2.0398 0.1362 7.2320 14.0798 0.4562 8.2306 10.3850 3.3011 1.1269 65.5548 5.6903 7.4858 110.8130 6.1489 19.4794 35.0960 137.0945 19.9097 18.5777 23.1325 6.6972 16.5689 258.6488 8.0200 25.8135 0.8247 16.5534 8.3605 20.0398 26.0570 181.7002 12.5279 323.3121 103.9270 54.0951 2.2304 18.5779 8.8406 64.8738 1.3554 93.5815 44.7768 25.3055 56.5540 20.9188 32.0599 29.2130 20.6621 13.0830 38.9706 24.3462 10.9612 34.9792 21.1351 14.2143 1.9747 16.2830 13.9378 3.0295 23.2034 17.5094 14.3435 19.8981 17.6930 8.0388 2.0813 7.1629 5.0119 18.5033 0.9134 18.7224 32.3495 62.0220 73.2080 8.1280 10.9689 27.7888 2.6737 9.4573 16.8253 11.7557 20.2030 14.0619 19.3997 8.7950 16.3681 20.4541
temp: 298.150 k
press: 1.00000 atm
elementType: 8 8 8 8 8 8 7 6 6 6 6 6 6 6 6 6 6 1 1 1 1 1 1 1 1 1 1 1 1 1 1 1 1 1
symmnumber: 1
zpe: 709114.3 jmol-1
zpe.correction: 0.270087 hartree
zpe.thermalcorrener: 0.289044 hartree
zpe.thermalcorrenthalpy: 0.289988 hartree
zpe.thermalcorrgfe: 0.223193 hartree
zpe.sumelectzpe: -895.928573 hartree
zpe.sumelectthermal: -895.909617 hartree
zpe.sumelectthermalent: -895.908672 hartree
zpe.sumelectthermalfe: -895.975467 hartree
dipole: 0.5224 3.1422 -2.8558
dipole: 4.2781
quadrupole: -89.1714 -113.4587 -102.4101
quadrupole: -0.2377 -15.1225 -0.2222
quadrupole: 12.5087 -11.7786 -0.7301 -0.2377 -15.1225 -0.2222
hfenergy: -896.1986606 hartree
pointgroup: C01 [X(C10H17N1O6)]
dipole: 0.5285508 -1.0436814 1.2100782 debye
polarizability: 152.4673015|5.5650395|137.5935857|-3.165128|3.2327662|106.3505524 unknown
InChI: InChI=1S/C10H17NO6/c1-10(2,4-11)17-9-8(15)7(14)6(13)5(3-12)16-9/h5-9,12-15H,3H2,1-2H3
charge 0 multiplicity 1
34 atoms
O  0.04193 0.871122 -0.308965
O  -1.674952 -0.69379 -0.373128
O  2.877957 -2.19837 -0.0351
O  3.754605 0.607035 0.33527
O  0.129909 -2.726672 0.671022
O  2.64368 2.692566 -1.399377
N  -2.719282 1.991578 1.651105
C  1.983313 -1.129326 0.418262
C  2.391047 0.242459 -0.129687
C  0.571942 -1.532209 -0.048159
C  1.337657 1.301693 0.260163
C  -0.429737 -0.408579 0.267903
C  1.675489 2.707093 -0.302007
C  -2.927086 -0.36069 0.376364
C  -3.20952 -1.47868 1.408512
C  -4.010365 -0.280269 -0.717069
C  -2.799949 0.952352 1.070459
H  1.98333 -1.088777 1.534657
H  2.485386 0.21151 -1.226058
H  0.591776 -1.699358 -1.144178
H  1.242921 1.34875 1.373216
H  -0.536278 -0.297472 1.372392
H  2.030566 3.360447 0.521135
H  0.753265 3.137057 -0.723426
H  3.813269 -1.882552 0.063124
H  3.735731 0.749355 1.317972
H  0.810631 -3.431667 0.517963
H  -3.279934 -2.43804 0.870176
H  -2.393623 -1.560816 2.145945
H  -4.15516 -1.284986 1.94441
H  -4.045775 -1.246617 -1.247527
H  -3.765376 0.512584 -1.441279
H  -4.998453 -0.075761 -0.271387
H  3.503485 2.341431 -1.043606
