program: Gaussian 09
title: 000134493
version: EM64L-G09RevD.01
frameworkgroup: C1[X(C7H14O6)]
method: RPBEPBE
basis: SDD
operation: Freq
keyword: #pfreq=noraman
keyword: PBEPBE/SDD
title: #p freq=noraman PBEPBE/SDD
converged: YES YES NO NO
title: Mulliken charges:
elementType: O O O O O O C C C C C C C H H H H H H H H H H H H H H
charge: -0.265978 -0.453773 -0.248663 -0.410933 -0.483127 -0.444362 -0.055335 -0.216699 -0.153041 -0.024112 -0.158616 -0.319627 -0.500132 0.252924 0.296002 0.197401 0.237310 0.205216 0.234951 0.187997 0.346839 0.354226 0.379273 0.212112 0.232687 0.238582 0.358879
chargesum: 0.00000
title: Mulliken charges with hydrogens summed into heavy atoms:
elementType: O O O O O O C C C C C C C
charge: -0.265978 -0.106934 -0.248663 -0.056707 -0.103854 -0.085483 0.197589 0.079303 0.044360 0.213198 0.046600 0.103321 0.183248
polarizability: 1.10865982e+02 -3.66199791e+00 9.69690167e+01 -1.75105754e-01 1.63999581e-01 7.76974613e+01
1716.lowfreq: -10.2977 0.0002 0.0004 0.0007 5.2720 15.5712 37.6758 68.9932 86.2561
frequency: 37.0823 68.9906 86.2531 101.0518 124.0128 132.7450 159.0888 197.0351 218.4249 253.7747 267.3204 287.5479 306.3495 336.6677 348.6228 394.3149 421.9506 457.6236 508.8244 521.5859 528.5375 614.6286 656.8581 690.6056 729.7010 807.3219 861.5550 872.4950 901.9906 918.8262 975.6708 980.5276 1019.6277 1027.5185 1039.0268 1052.0045 1072.4764 1079.3614 1112.9645 1136.5353 1147.2100 1170.2279 1178.3520 1215.9043 1229.0625 1241.3781 1263.8666 1277.6141 1301.1586 1308.6938 1330.6617 1337.4501 1348.7336 1369.9979 1375.7629 1389.8422 1399.5778 1432.4890 1458.5472 1463.6066 1475.8586 2912.8424 2945.6406 2961.1318 2962.0107 3023.9541 3033.3276 3055.5178 3103.4953 3105.4165 3125.1520 3446.7114 3520.0790 3532.2618 3557.0073
redmass: 6.0213 3.6046 4.0920 5.3926 2.4953 2.5427 1.6947 3.7887 3.0391 3.5436 2.0013 2.6773 4.5463 3.9264 2.5296 2.1304 1.8350 4.4720 1.1759 5.6100 3.7045 5.2330 1.0848 4.5003 5.7428 3.8621 2.6014 4.0856 4.0747 7.1729 4.2010 4.6448 4.6911 3.1515 2.2398 2.9140 2.9674 3.8588 1.2694 1.4342 1.9270 1.2343 1.4507 1.2257 1.2389 1.1959 1.2506 1.1802 1.2835 1.2785 1.2923 1.2430 1.3067 1.3001 1.1847 1.6876 1.5747 1.1540 1.0506 1.0857 1.0521 1.0821 1.0790 1.0340 1.0737 1.0860 1.0882 1.1014 1.0942 1.0878 1.1009 1.0654 1.0649 1.0657 1.0662
irintensity: 2.0442 6.3707 5.2238 1.7760 2.1403 2.0399 1.7748 8.3296 42.6596 16.0691 58.2723 12.9411 43.0060 4.7675 25.4505 57.4934 136.5632 6.5885 128.8371 2.9657 45.1858 9.2372 149.5181 14.9212 8.1036 27.9073 31.1108 69.1801 4.4501 329.5573 25.3152 62.5181 49.2777 35.7341 11.0682 115.5873 80.7585 85.3896 0.0951 13.7742 9.5157 21.0200 2.9288 41.7563 6.4358 5.2394 2.6943 57.1533 15.4238 17.0128 8.3464 27.6443 6.0901 75.8645 17.4974 2.7104 8.7767 6.3251 12.0274 4.1026 10.8373 54.0604 10.9439 57.6816 98.8201 30.7908 49.8893 39.9907 16.4782 8.6741 20.6745 77.1506 13.6042 6.8819 10.9484
temp: 298.150 k
press: 1.00000 atm
elementType: 8 8 8 8 8 8 6 6 6 6 6 6 6 1 1 1 1 1 1 1 1 1 1 1 1 1 1
symmnumber: 1
zpe: 570068.7 jmol-1
zpe.correction: 0.217128 hartree
zpe.thermalcorrener: 0.231570 hartree
zpe.thermalcorrenthalpy: 0.232514 hartree
zpe.thermalcorrgfe: 0.175818 hartree
zpe.sumelectzpe: -725.351251 hartree
zpe.sumelectthermal: -725.336809 hartree
zpe.sumelectthermalent: -725.335865 hartree
zpe.sumelectthermalfe: -725.392561 hartree
dipole: 2.7595 1.3257 -0.8099
dipole: 3.1667
quadrupole: -97.0890 -68.8686 -76.6627
quadrupole: -9.4355 -4.0759 -6.6082
quadrupole: -16.2155 12.0048 4.2107 -9.4355 -4.0759 -6.6082
hfenergy: -725.5683791 hartree
pointgroup: C01 [X(C7H14O6)]
dipole: -1.053195 -0.6013207 -0.2852983 debye
polarizability: 111.3036018|-2.656191|96.5150558|-0.5586059|-0.367139|77.7138022 unknown
InChI: InChI=1S/C7H14O6/c1-12-7-5(11)4(10)6(13-7)3(9)2-8/h3-11H,2H2,1H3
charge 0 multiplicity 1
27 atoms
O  -0.319685 0.954818 -0.714781
O  0.588096 -2.393981 0.143038
O  -2.394858 0.813992 0.525152
O  -2.636727 -1.845682 -0.242401
O  2.724637 -0.700784 0.760642
O  4.017679 1.278779 -0.658543
C  0.472072 0.167164 0.287418
C  -0.263833 -1.210917 0.403965
C  -1.445783 -1.10463 -0.59651
C  -1.695189 0.413075 -0.662646
C  1.924606 0.079192 -0.203701
C  2.617588 1.447124 -0.273773
C  -2.756281 2.241492 0.529102
H  0.440906 0.69295 1.259914
H  -0.645382 -1.37473 1.422267
H  -1.069449 -1.405898 -1.60336
H  -2.18994 0.773328 -1.583649
H  1.96008 -0.388008 -1.212545
H  2.150502 2.079424 -1.04418
H  2.530368 1.945717 0.716063
H  0.779264 -2.451144 -0.829423
H  -2.393235 -2.797483 -0.111655
H  2.32572 -1.614239 0.804464
H  -3.439074 2.474404 -0.312792
H  -1.85524 2.878887 0.46245
H  -3.27427 2.413297 1.484121
H  4.381728 0.567252 -0.067238
