program: Gaussian 09
title: 000134461
version: EM64L-G09RevD.01
frameworkgroup: C1[X(C13H11N3O2S)]
method: RPBEPBE
basis: SDD
operation: Freq
keyword: #p
keyword: freq=noraman
keyword: PBEPBE/SDD
title: #p freq=noraman PBEPBE/SDD
converged: YES YES NO NO
title: Mulliken charges:
elementType: S O O N N N C C C C C C C C C C C C C H H H H H H H H H H H
charge: 0.858941 -0.536029 -0.548666 -0.476875 -0.094829 -0.604489 -0.052074 0.363790 -0.399039 0.032456 -0.039126 -0.234474 -0.312283 0.112846 -0.250245 -0.253318 -0.207319 -0.207090 -0.219773 0.292421 0.268552 0.254988 0.312734 0.278358 0.280131 0.237660 0.239193 0.235065 0.349057 0.319438
chargesum: 0.00000
title: Mulliken charges with hydrogens summed into heavy atoms:
elementType: S O O N N N C C C C C C C C C C C C C
charge: 0.858941 -0.536029 -0.548666 -0.164142 -0.094829 0.064006 -0.052074 0.363790 -0.106619 0.032456 -0.039126 0.034078 -0.057295 0.112846 0.028113 0.026814 0.030341 0.032104 0.015292
polarizability: 2.73849713e+02 -8.87014422e+00 1.49607131e+02 -1.42696281e+01 2.26692430e+01 1.67220399e+02
1716.lowfreq: -13.0771 -3.9676 -0.0013 -0.0006 0.0009 2.7093 21.9278 33.3778 41.5057
frequency: 21.5984 33.3139 41.4780 94.5651 109.1497 157.0395 166.6420 190.4400 199.7290 217.4189 242.2009 243.8700 278.6267 309.0284 356.6497 382.5050 390.9383 405.1187 429.9622 460.7310 462.1687 495.6562 498.4463 544.9105 545.7039 603.2251 608.2439 654.0676 670.7888 684.6799 692.3084 693.9324 763.0504 766.5658 782.4572 830.2917 834.4929 853.5409 883.1585 891.0901 920.3655 935.0933 955.0906 963.5539 979.9209 982.7495 1003.4213 1009.1938 1032.2035 1037.4221 1049.3625 1075.6613 1122.2387 1172.0391 1175.8724 1207.9555 1222.9418 1273.6988 1293.5145 1300.5174 1383.5291 1386.7111 1406.3290 1434.4855 1451.8687 1454.4721 1470.5680 1573.2678 1578.9631 1590.8904 1605.5689 1621.8087 1655.3707 3134.0445 3144.1190 3151.9247 3153.0573 3155.0217 3161.8929 3172.1783 3178.4026 3574.1865 3600.1436 3720.9783
redmass: 4.9119 4.7687 4.8312 6.1355 8.2207 6.7413 6.2170 1.3365 3.4069 6.3034 7.0450 8.3362 5.0064 4.4079 6.3578 7.1362 7.3028 2.8350 2.9628 1.3772 4.1667 3.6171 4.3810 1.4240 3.4014 6.4740 4.1721 7.1328 7.9335 6.1419 8.2323 2.2983 1.6218 3.3757 9.7833 2.1436 2.5766 1.2464 3.3521 1.7558 14.9569 1.3844 1.3729 3.2282 5.3841 1.4144 1.3431 4.0657 2.1776 2.0474 2.1446 1.5475 1.4633 1.0593 1.1245 3.4694 1.3095 4.8711 1.4361 1.3115 7.8603 3.7677 4.6905 2.2455 2.5991 2.3321 7.0575 2.3790 5.7497 4.3902 6.9388 2.7003 3.7033 1.0855 1.0882 1.0928 1.0919 1.0893 1.0967 1.1016 1.0966 1.0456 1.0810 1.1050
irintensity: 2.9577 0.1905 1.3488 0.3303 3.1425 2.1826 6.7256 60.8729 21.7443 12.9933 1.6824 8.7306 1.0594 4.5942 0.1717 12.5618 20.7915 0.0609 15.0232 306.0850 35.0384 13.3587 78.4791 114.0634 33.8620 0.0179 35.6060 2.2562 28.5147 8.7136 3.3849 38.2424 84.1672 0.3699 63.7712 25.4094 9.2765 0.8062 15.8717 19.8045 68.6395 1.9775 0.8911 0.4308 2.3297 0.0895 0.4334 2.3374 35.9938 25.5415 15.7614 5.7941 23.9696 0.2573 6.6060 2.8951 0.6448 127.6103 10.4406 6.9575 2.8259 28.2856 58.9873 19.2533 57.0241 9.1014 53.1042 230.2959 4.0924 22.7887 0.6425 149.4438 521.8432 0.7326 10.0253 4.9406 3.5149 1.7419 5.7374 33.0091 5.5529 174.3998 42.1303 48.7387
temp: 298.150 k
press: 1.00000 atm
elementType: 16 8 8 7 7 7 6 6 6 6 6 6 6 6 6 6 6 6 6 1 1 1 1 1 1 1 1 1 1 1
symmnumber: 1
zpe: 573982.5 jmol-1
zpe.correction: 0.218618 hartree
zpe.thermalcorrener: 0.235379 hartree
zpe.thermalcorrenthalpy: 0.236323 hartree
zpe.thermalcorrgfe: 0.172941 hartree
zpe.sumelectzpe: -1213.265703 hartree
zpe.sumelectthermal: -1213.248943 hartree
zpe.sumelectthermalent: -1213.247998 hartree
zpe.sumelectthermalfe: -1213.311381 hartree
dipole: -4.5938 7.3967 0.3291
dipole: 8.7133
quadrupole: -80.0765 -122.8488 -114.5179
quadrupole: 0.8216 -24.4891 12.8817
quadrupole: 25.7379 -17.0344 -8.7035 0.8216 -24.4891 12.8817
hfenergy: -1213.4843217 hartree
pointgroup: C01 [X(C13H11N3O2S1)]
dipole: 1.7044464 -2.9729685 -0.0898905 debye
polarizability: 272.7969548|-14.0101175|154.1747162|13.509739|-24.3504073|163.7055724 unknown
InChI: InChI=1S/C13H11N3O2S/c14-13-15-11-7-6-10(8-12(11)16-13)19(17,18)9-4-2-1-3-5-9/h1-8,16H,14H2
charge 0 multiplicity 1
30 atoms
S  -1.471769 1.298885 0.871791
O  -1.893745 2.73849 0.213857
O  -1.413219 1.028684 2.49051
N  3.431585 -0.910618 1.030047
N  4.06673 -0.181283 -1.052132
N  5.665952 -1.456066 0.218846
C  0.227959 0.838973 0.197654
C  2.325011 -0.203588 0.51785
C  1.057775 0.08229 1.045223
C  2.749638 0.243953 -0.785999
C  -2.682532 0.015666 0.160836
C  0.59616 1.325282 -1.075396
C  1.877642 1.019698 -1.583359
C  4.437266 -0.861954 0.051197
C  -2.930409 -1.144838 0.909886
C  -3.324397 0.319003 -1.049765
C  -3.859227 -2.075981 0.388666
C  -4.249936 -0.623715 -1.555634
C  -4.509645 -1.817737 -0.8416
H  0.713072 -0.208744 2.042776
H  -0.09952 1.957046 -1.636758
H  2.200891 1.380221 -2.563531
H  3.483976 -1.357982 1.942791
H  -2.435863 -1.294489 1.875453
H  -3.127367 1.270114 -1.555643
H  -4.079743 -2.992753 0.945677
H  -4.770883 -0.421233 -2.497328
H  -5.230016 -2.541893 -1.237726
H  6.333936 -1.363826 -0.54148
H  5.931778 -1.949706 1.064389
