program: Gaussian 09
title: 000134460
version: EM64L-G09RevD.01
frameworkgroup: C1[X(C7H14O2)]
method: RPBEPBE
basis: SDD
operation: Freq
keyword: #pfreq=noraman
keyword: PBEPBE/SDD
title: #p freq=noraman PBEPBE/SDD
converged: YES YES NO NO
title: Mulliken charges:
elementType: O O C C C C C C C H H H H H H H H H H H H H H
charge: -0.416930 -0.236112 0.021913 -0.395698 -0.420408 -0.527899 -0.711784 -0.715460 0.168270 0.221568 0.193377 0.202113 0.226561 0.210659 0.250796 0.247700 0.214735 0.221428 0.215565 0.221001 0.219030 0.215168 0.374407
chargesum: 0.00000
title: Mulliken charges with hydrogens summed into heavy atoms:
elementType: O O C C C C C C C
charge: -0.042522 -0.236112 0.243481 -0.000208 0.016811 -0.029403 -0.060057 -0.060261 0.168270
polarizability: 9.40866048e+01 -3.51275307e+00 7.30996207e+01 6.83256338e-01 -4.84333154e-01 7.58650134e+01
1716.lowfreq: -34.0702 -13.1015 -0.0004 -0.0003 0.0006 12.0527 22.6312 49.5217 82.6078
frequency: 18.2016 48.7624 82.5446 122.0828 142.2527 219.5289 231.4256 252.0837 297.0049 328.8124 343.3480 475.3314 515.9944 522.5931 590.0126 653.8749 743.6291 766.2670 813.4106 852.4577 895.1870 936.4495 983.2862 1006.5995 1032.3326 1043.2941 1058.8085 1110.0119 1149.8913 1162.7660 1187.9892 1239.3420 1250.2069 1272.6197 1286.4757 1327.5188 1341.6568 1354.4156 1361.9725 1388.7540 1390.8006 1433.4602 1466.7647 1474.3882 1480.8994 1485.0932 1486.9452 1497.5132 1664.5249 2963.7782 2974.9777 2977.3982 2977.9919 2981.6502 2993.9392 3014.6227 3033.2134 3056.2296 3070.0976 3070.9037 3073.4441 3077.3469 3505.7475
redmass: 5.7340 3.7419 2.4656 1.5266 3.3845 1.1596 1.4559 2.4707 2.1946 3.3870 2.5556 2.1217 2.2857 2.3923 3.7461 1.4008 1.5309 1.4460 1.4449 4.4101 1.6439 1.9181 2.2332 1.3717 1.7383 2.0160 2.4105 1.8771 1.8419 2.5927 1.2471 1.3687 1.3289 1.1101 1.4375 1.5497 1.5808 1.4955 1.5389 1.2279 1.2068 1.0930 1.0617 1.0522 1.0604 1.0436 1.0532 1.0712 8.2171 1.0595 1.0746 1.0382 1.0424 1.0608 1.0668 1.0990 1.1000 1.0937 1.0991 1.0993 1.0992 1.0995 1.0638
irintensity: 0.8437 0.7154 0.1043 0.0996 1.5472 0.0437 0.2655 1.0009 0.9778 3.6087 1.7355 10.6676 37.2850 0.9991 21.6840 134.2445 11.7824 5.1549 5.7078 4.0658 4.8626 14.2864 25.7825 4.6047 17.6013 223.1298 2.5403 21.7764 1.5807 14.5280 2.9667 1.0068 3.2207 8.9971 9.7276 4.5436 23.7846 3.3929 23.5171 23.8115 11.7613 25.2278 6.2342 15.7295 22.9662 1.6135 10.0141 7.8121 189.8038 35.8009 10.6625 23.4272 21.3241 28.6715 21.7372 36.6718 12.9291 13.8271 50.1565 44.9375 86.8530 38.8360 17.6525
temp: 298.150 k
press: 1.00000 atm
elementType: 8 8 6 6 6 6 6 6 6 1 1 1 1 1 1 1 1 1 1 1 1 1 1
symmnumber: 1
zpe: 523730.6 jmol-1
zpe.correction: 0.199478 hartree
zpe.thermalcorrener: 0.210659 hartree
zpe.thermalcorrenthalpy: 0.211603 hartree
zpe.thermalcorrgfe: 0.161307 hartree
zpe.sumelectzpe: -424.855943 hartree
zpe.sumelectthermal: -424.844763 hartree
zpe.sumelectthermalent: -424.843818 hartree
zpe.sumelectthermalfe: -424.894115 hartree
dipole: 0.4542 0.0897 -1.3110
dipole: 1.3903
quadrupole: -51.7245 -55.6660 -61.8137
quadrupole: -1.3114 1.6895 1.9903
quadrupole: 4.6769 0.7354 -5.4123 -1.3114 1.6895 1.9903
hfenergy: -425.0554218 hartree
pointgroup: C01 [X(C7H14O2)]
dipole: -0.1865313 0.0998801 0.50441 debye
dipolederiv: -0.986263 -0.1691864 -0.5153879 -0.2096634 -0.4649396 -0.1067332 -0.4361934 -0.0834857 -0.5654649 -0.6784657 0.0465494 0.1603135 -0.044681 -0.3654095 -0.1450615 -0.0956511 -0.1703982 -0.8984307 0.1520092 -0.018932 0.0139134 0.0203552 0.114197 -0.0107283 0.0655777 -0.0091398 0.0520069 0.0411969 0.0056302 -0.0089878 -0.0090951 0.1393903 0.0442769 -0.0416537 0.0420237 0.0933417 0.0614061 -0.0049759 0.0226171 -0.0105939 0.0884724 0.0249132 -0.0012842 0.0396883 0.0626362 -0.2894404 -0.0333784 0.0711121 -0.0954071 0.0975721 0.0511137 0.1924125 0.0313692 -0.0929799 -0.0786393 -0.0099496 -0.0496345 -0.0119553 0.0866326 0.0063547 -0.0244439 0.0071089 0.044733 0.0934074 0.0292303 0.0063486 0.0319427 -0.075189 -0.0486945 0.0089415 -0.0463258 0.014029 1.464754 0.135637 0.1540319 0.283823 0.2934802 0.2921294 0.2136588 0.3001556 1.2243834 0.0613139 0.0147063 0.009194 0.0171496 -0.0857817 -0.0863679 -0.0033112 -0.0893151 -0.0483631 0.0181157 0.044802 -0.0353054 0.0302914 -0.1582586 0.1265179 -0.0246153 0.1063961 0.0089445 0.0183169 -0.0112191 -0.00983 0.0165524 -0.0143096 -0.1522991 0.0034779 -0.1210911 -0.0864581 -0.0843353 -0.0539209 0.1340648 -0.0547998 0.0178037 -0.0002802 0.1130778 -0.0028615 0.0137031 -0.0601638 0.0269604 -0.1588074 0.0258906 0.019511 -0.0274196 -0.1420866 -0.0346322 -0.0458149 0.0531183 -0.0091491 0.0123667 -0.0133877 0.0183795 -0.1268509 -0.0166471 -0.0919348 0.0231547 0.0685964 0.0134235 0.0139498 0.0471072 -0.0594385 0.097639 -0.0103126 0.0794915 0.0504708 0.0734866 0.0442717 0.0381117 0.0051251 -0.0035531 -0.1206425 -0.023511 -0.125525 -0.0816949 0.0844339 0.0447044 -0.0298595 0.0800737 -0.1286376 0.0837405 -0.0486698 0.0710024 0.0406678 -0.1321919 -0.0804818 0.0857912 -0.0932328 0.0601037 0.0417333 0.122986 0.059272 0.014363 -0.1163068 -0.0042821 0.113213 -0.0397884 0.0982252 0.0130666 0.116956 -0.0109347 0.0063759 0.0884888 0.0156819 -0.0034926 0.0218397 -0.1477823 0.0953884 -0.009072 0.1335541 0.0243692 -0.059683 -0.0330711 -0.1274414 -0.0053639 0.0956567 -0.0099921 -0.1227216 -0.0479861 -0.0478134 0.206845 0.0069491 0.1037189 0.0078175 0.3738749 -0.0418036 0.1630854 -0.0364318 0.1938406 unknown
polarizability: 94.3648039|2.4757766|72.9296215|0.8036255|0.8168368|75.7568135 unknown
InChI: InChI=1S/C7H14O2/c1-3-6(4-2)5-7(8)9/h6,8H,3-5H2,1-2H3
charge 0 multiplicity 1
23 atoms
O  2.983507 0.002491 0.833125
O  2.120021 -0.693263 -1.203309
C  -0.635124 -0.329328 -0.166813
C  -1.904015 -0.707178 0.645978
C  -0.735805 1.055385 -0.871459
C  0.610838 -0.423861 0.750383
C  -3.20126 -0.743574 -0.190451
C  -0.991487 2.261614 0.061468
C  1.92516 -0.393189 -0.004579
H  -0.507456 -1.086043 -0.968671
H  -1.74258 -1.707339 1.098848
H  -2.029644 -0.003752 1.494013
H  0.196176 1.222527 -1.445609
H  -1.54575 1.006858 -1.624598
H  0.623284 0.372436 1.515494
H  0.591211 -1.381914 1.310787
H  -3.09022 -1.413656 -1.063854
H  -3.474515 0.258244 -0.568202
H  -4.049992 -1.113644 0.413561
H  -1.94774 2.16232 0.607426
H  -1.040549 3.197407 -0.524863
H  -0.187283 2.387569 0.810179
H  3.834022 -0.02661 0.314947
