program: Gaussian 09
title: 000134451
version: EM64L-G09RevD.01
frameworkgroup: C1[X(C17H15N3O)]
method: RPBEPBE
basis: SDD
operation: Freq
keyword: #p
keyword: freq=noraman
keyword: PBEPBE/SDD
title: #p freq=noraman PBEPBE/SDD
converged: YES YES NO NO
title: Mulliken charges:
elementType: O N N N C C C C C C C C C C C C C C C C C H H H H H H H H H H H H H H H
charge: -0.269949 -0.249578 -0.054300 -0.078104 -0.473304 0.273518 0.162513 0.126711 -0.048205 -0.387746 -0.390949 0.353487 -0.224607 -0.228283 -0.546886 -0.388443 0.364553 -0.221673 -0.384397 -0.242065 -0.686094 0.262200 0.262188 0.240125 0.263789 0.231893 0.233317 0.291574 0.261497 0.221123 0.245119 0.205899 0.205910 0.204336 0.232471 0.232362
chargesum: 0.00000
title: Mulliken charges with hydrogens summed into heavy atoms:
elementType: O N N N C C C C C C C C C C C C C C C C C
charge: -0.269949 -0.249578 -0.054300 -0.078104 0.051084 0.273518 0.162513 0.126711 -0.048205 -0.147621 -0.127160 0.353487 0.007286 0.005033 -0.255312 -0.126946 0.364553 -0.000550 -0.139278 0.169744 -0.016926
polarizability: 3.69873561e+02 -1.36453992e+01 2.19373496e+02 -9.20089197e-02 -1.39781589e-01 9.30656657e+01
1716.lowfreq: -8.8129 -5.3102 -0.0002 0.0002 0.0007 1.8533 28.8771 42.8573 51.0292
frequency: 28.5420 42.8224 51.0233 64.1561 100.1498 133.8099 140.0385 173.2843 215.7452 221.9634 229.2024 232.7508 246.2754 276.5430 329.3152 332.0245 371.8235 421.6098 453.8423 461.8661 481.9820 515.3720 566.8991 582.4839 584.7579 597.8644 668.9029 684.1363 696.6943 696.7602 727.9737 741.2314 768.9671 778.9851 793.7093 806.3104 813.1565 827.6008 877.5909 890.5323 908.7286 925.5920 948.5361 950.1997 975.8778 983.3900 989.9644 994.9716 1005.2009 1027.3149 1039.5491 1078.4318 1096.4520 1102.5275 1116.6606 1134.2227 1158.2992 1164.0501 1167.4996 1178.5652 1181.7073 1198.8728 1205.9731 1231.8699 1258.4621 1286.5831 1290.8853 1307.8583 1351.8021 1361.5068 1390.4492 1395.3576 1399.7505 1406.5264 1434.3255 1453.2690 1459.5999 1459.6231 1460.8202 1478.6507 1490.4900 1504.2872 1540.0914 1585.5247 1597.0470 1624.7349 1637.7294 2949.7573 2996.0788 3007.4564 3009.0105 3063.5310 3093.2679 3105.3423 3130.8486 3132.3928 3142.5322 3158.0795 3162.0418 3171.8738 3172.1002 3175.6155
redmass: 4.1349 4.5190 4.9172 4.5233 2.0197 3.5917 4.1079 6.1954 2.8853 4.8855 2.2971 6.0892 1.6659 3.6147 5.9284 3.5109 5.5435 2.8228 3.1882 4.9001 7.0963 3.6363 7.0392 5.3736 5.8209 5.7798 6.9332 4.9625 4.6399 2.5692 2.5481 2.8525 5.4850 1.9077 1.6518 5.0352 4.3707 1.1078 1.3042 1.4082 5.7183 1.5230 1.4301 4.0624 1.3346 5.8256 1.7667 1.3529 4.6529 2.5486 2.7993 2.5377 2.2537 1.6441 2.1527 1.4332 1.1062 2.5573 1.3193 1.2334 2.0622 2.3621 2.8824 3.9518 1.1469 5.2909 1.4421 1.6570 3.3400 1.4018 4.1476 2.1046 2.4195 3.4287 2.3950 2.6424 1.3251 1.0401 2.0248 1.0764 1.1029 5.2005 8.5057 6.2119 6.7719 6.7594 8.0391 1.0552 1.0361 1.1074 1.0586 1.1044 1.0989 1.1013 1.0868 1.0871 1.0902 1.0949 1.0917 1.0959 1.0999 1.0940
irintensity: 1.1088 4.1263 1.4658 0.7543 1.3173 0.0094 0.0527 0.7090 3.8819 0.2574 0.0169 0.7303 1.8421 2.0625 2.9723 1.6032 0.8654 9.7157 2.3113 2.2477 0.5218 0.0867 0.5757 1.1453 3.3013 2.6627 1.0066 5.2593 9.5079 14.9158 1.4850 84.7420 0.1401 30.8732 42.7683 2.2639 12.2624 0.0550 0.6336 0.0045 29.6562 26.6183 1.4744 57.2052 1.1588 1.6687 2.2351 0.0216 10.4854 2.1992 110.5740 39.3275 4.4164 14.6767 6.0987 4.3091 0.3013 2.2510 3.6016 18.9235 1.2663 54.6830 81.7560 70.4619 0.0796 4.5989 23.7841 5.5052 3.8119 20.5161 26.2711 19.8403 25.0671 101.8364 29.8105 104.1190 0.8536 11.6091 84.0835 4.9756 4.1200 21.5181 11.4037 67.6675 0.9076 72.9559 3.5792 46.5770 29.6091 39.3062 19.6419 5.0657 32.4471 35.0461 1.7060 15.6239 10.8625 21.5025 14.5449 10.8888 17.1548 6.4061
temp: 298.150 k
press: 1.00000 atm
elementType: 8 7 7 7 6 6 6 6 6 6 6 6 6 6 6 6 6 6 6 6 6 1 1 1 1 1 1 1 1 1 1 1 1 1 1 1
symmnumber: 1
zpe: 741914.7 jmol-1
zpe.correction: 0.282580 hartree
zpe.thermalcorrener: 0.299653 hartree
zpe.thermalcorrenthalpy: 0.300598 hartree
zpe.thermalcorrgfe: 0.236456 hartree
zpe.sumelectzpe: -894.811330 hartree
zpe.sumelectthermal: -894.794257 hartree
zpe.sumelectthermalent: -894.793313 hartree
zpe.sumelectthermalfe: -894.857454 hartree
dipole: -2.2567 -0.6188 0.0103
dipole: 2.3400
quadrupole: -71.5138 -114.3014 -127.0966
quadrupole: 2.2092 -0.0186 -0.0206
quadrupole: 32.7901 -9.9974 -22.7927 2.2092 -0.0186 -0.0206
hfenergy: -895.0939104 hartree
pointgroup: C01 [X(C17H15N3O1)]
dipole: 0.8793932 -0.271802 0.0189749 debye
polarizability: 370.494043|8.8395577|218.6076734|5.2491147|-2.2389126|93.2110064 unknown
InChI: InChI=1S/C17H15N3O/c1-2-21-14-8-5-7-12(10-14)16-18-17-15-9-4-3-6-13(15)11-20(17)19-16/h3-10H,2,11H2,1H3
charge 0 multiplicity 1
36 atoms
O  -4.494662 1.429534 -0.181586
N  1.922475 -1.274525 -0.000895
N  0.678874 -1.871398 -0.013757
N  0.523894 0.473723 -0.058114
C  3.298274 -1.787106 0.032915
C  4.080833 -0.464922 0.024318
C  3.181987 0.651886 -0.011516
C  1.825441 0.110195 -0.027161
C  -0.150133 -0.760913 -0.048358
C  5.468125 -0.258536 0.046307
C  3.667166 1.974124 -0.025172
C  -1.615448 -0.876363 -0.074279
C  5.958082 1.073606 0.03254
C  5.067477 2.174705 -0.002678
C  -2.402386 0.296778 -0.113754
C  -2.243582 -2.154211 -0.060898
C  -3.813458 0.201714 -0.140738
C  -3.647201 -2.233712 -0.08713
C  -4.447996 -1.066278 -0.127187
C  -5.968853 1.398096 -0.212029
C  -6.438364 2.849973 -0.256453
H  3.50966 -2.417267 -0.849808
H  3.477236 -2.38641 0.943831
H  6.165727 -1.103124 0.07359
H  2.972695 2.819218 -0.052414
H  7.038617 1.252388 0.049388
H  5.469189 3.193595 -0.012648
H  -1.922053 1.278936 -0.124316
H  -1.626163 -3.056484 -0.030479
H  -4.135656 -3.21461 -0.076601
H  -5.537776 -1.158112 -0.146722
H  -6.309386 0.837769 -1.107626
H  -6.348023 0.879958 0.693378
H  -7.542662 2.893165 -0.277063
H  -6.081771 3.400503 0.630743
H  -6.050079 3.356304 -1.15653
