program: Gaussian 09
title: 000134443
version: EM64L-G09RevD.01
frameworkgroup: C1[X(C16H22O3)]
method: RPBEPBE
basis: SDD
operation: Freq
keyword: #pfreq=noraman
keyword: PBEPBE/SDD
title: #p freq=noraman PBEPBE/SDD
converged: YES YES NO NO
title: Mulliken charges:
elementType: O O O C C C C C C C C C C C C C C C C H H H H H H H H H H H H H H H H H H H H H H
charge: -0.251867 -0.448005 -0.264352 0.168568 -0.644986 0.356259 -0.044400 0.004835 -0.375898 -0.714245 0.174072 0.230995 -0.668953 0.348963 -0.585214 -0.852903 -0.849853 -0.292300 -0.495657 0.241585 0.238945 0.190137 0.213928 0.250889 0.219072 0.218589 0.250069 0.247386 0.238859 0.229420 0.239414 0.303035 0.235371 0.237767 0.242838 0.368046 0.197296 0.203253 0.202973 0.235516 0.200552
chargesum: 0.00000
title: Mulliken charges with hydrogens summed into heavy atoms:
elementType: O O O C C C C C C C C C C C C C C C C
charge: -0.251867 -0.079959 -0.264352 0.168568 -0.164455 0.356259 -0.044400 0.004835 0.028167 -0.025695 0.174072 0.230995 -0.418883 0.348963 -0.098969 -0.081033 -0.133878 0.108248 0.143385
polarizability: 2.55193072e+02 -9.23016819e+00 1.87399310e+02 6.40187540e+00 1.08076318e+01 1.24444592e+02
1716.lowfreq: -9.9156 -1.3731 -0.0008 -0.0007 -0.0006 9.4680 27.6981 36.0173 50.8192
frequency: 27.0999 35.9856 50.7561 71.1822 81.6979 122.8313 137.5233 142.7403 144.9547 152.0973 163.9676 189.9531 204.7337 224.2490 225.3598 229.9875 263.4325 274.3572 288.8584 321.9032 330.9795 352.8276 361.0936 365.1783 410.2578 428.2975 504.0519 520.8011 536.5537 561.6418 583.4761 596.6702 601.2589 663.5936 677.2013 724.1772 779.1642 783.3414 806.5132 860.3537 867.7114 899.4039 901.7756 923.0615 948.3718 979.2767 987.0695 1000.5886 1011.6286 1026.8839 1031.4317 1040.4475 1047.5122 1071.1922 1084.6863 1092.5578 1105.4451 1117.7155 1145.6995 1156.7477 1171.6487 1176.4335 1196.7059 1214.8763 1230.0737 1234.9455 1270.9160 1290.8421 1297.3797 1313.7286 1324.5010 1372.0692 1379.6484 1382.7328 1399.3506 1400.1084 1402.8595 1425.1965 1425.8310 1439.4330 1452.7136 1458.9130 1463.9284 1466.2285 1471.5517 1472.6744 1472.9957 1475.0232 1480.5066 1488.5278 1496.5073 1502.3891 1579.4650 1583.0306 1611.5418 2913.4986 2924.7907 2927.6397 2960.1533 2972.6247 2977.0410 2977.9502 2981.1320 2998.8639 3023.7849 3038.4367 3041.3007 3051.4674 3054.7915 3074.8456 3079.3378 3088.8887 3100.4177 3103.7680 3112.3239 3126.0709 3401.5578
redmass: 4.8291 4.0225 3.7168 2.9035 2.7338 2.6597 2.7079 1.0677 3.3274 1.9455 1.5405 2.7581 1.6983 1.5124 1.2750 4.0584 3.9678 2.4708 3.7172 3.5836 4.0097 2.2784 2.5757 4.0042 4.4489 3.3256 4.0051 4.3087 3.0710 2.6016 3.5125 3.8904 1.3140 5.1608 4.6035 4.5502 3.6215 4.3707 1.3338 2.4814 1.6048 2.9674 2.5584 1.9796 1.7818 1.7902 1.8537 4.8519 1.4211 2.7322 2.2006 1.5668 2.7332 5.6335 1.9687 1.7916 2.0920 1.3013 1.8336 1.4635 2.6693 1.2421 1.3868 1.7929 2.4624 1.7841 1.1722 1.9801 1.5902 5.2622 1.2897 1.3091 1.5405 2.1231 1.2307 1.2766 1.3255 2.1018 3.4092 1.1480 1.1114 1.0509 1.0857 1.0700 1.0834 1.0614 1.2766 1.0909 1.2202 1.0818 1.0565 1.0952 8.4471 6.9754 7.4084 1.0516 1.0680 1.0370 1.1060 1.0647 1.0403 1.0387 1.0357 1.1027 1.0596 1.0967 1.0950 1.0946 1.0954 1.1004 1.1022 1.0990 1.0993 1.0973 1.0982 1.0917 1.0658
irintensity: 0.6304 0.2537 0.4043 4.1243 5.7802 0.9906 2.4695 0.6674 3.3687 3.1971 0.3129 1.7037 0.9741 4.2488 2.1608 3.9344 4.3999 1.8410 8.3903 11.3778 1.8819 0.5554 1.4341 0.2301 1.8095 2.4568 0.5632 10.8007 3.9329 22.4788 1.2427 2.3850 159.6404 15.8506 4.7766 1.8279 1.6255 0.5932 7.5492 4.0830 4.8063 15.1775 28.9838 17.4560 4.8278 8.5735 89.5367 75.6803 9.8904 5.5672 13.7365 1.8216 47.0753 136.2212 3.2932 5.4477 28.0986 0.3070 5.5507 5.4004 0.4963 0.8072 24.8843 2.8975 17.5147 24.0746 0.9777 3.9972 11.7968 43.9076 46.0969 24.1764 10.9724 68.8673 20.4714 69.0772 65.9426 11.9102 13.6496 1.1946 29.4769 12.7544 10.1164 19.0697 7.5252 16.5308 27.3569 6.8410 31.5485 1.4888 22.4583 7.3132 247.4812 28.4118 50.7078 49.2493 65.0388 99.9534 52.9481 24.2275 22.4423 25.1299 24.1493 66.6394 26.0402 11.9885 41.3211 16.2067 15.8717 30.9274 22.3506 14.9003 11.0629 33.4989 1.1474 16.8802 71.7606
temp: 298.150 k
press: 1.00000 atm
elementType: 8 8 8 6 6 6 6 6 6 6 6 6 6 6 6 6 6 6 6 1 1 1 1 1 1 1 1 1 1 1 1 1 1 1 1 1 1 1 1 1 1
symmnumber: 1
zpe: 903158.3 jmol-1
zpe.correction: 0.343995 hartree
zpe.thermalcorrener: 0.364322 hartree
zpe.thermalcorrenthalpy: 0.365266 hartree
zpe.thermalcorrgfe: 0.295013 hartree
zpe.sumelectzpe: -847.120833 hartree
zpe.sumelectthermal: -847.100505 hartree
zpe.sumelectthermalent: -847.099561 hartree
zpe.sumelectthermalfe: -847.169815 hartree
dipole: -4.0215 3.9276 1.2122
dipole: 5.7505
quadrupole: -128.5437 -112.0523 -113.4219
quadrupole: 14.8500 -10.2227 0.7465
quadrupole: -10.5377 5.9537 4.5840 14.8500 -10.2227 0.7465
hfenergy: -847.4648274 hartree
pointgroup: C01 [X(C16H22O3)]
dipole: -1.579308 1.5579105 0.4440694 debye
polarizability: 255.0181574|-9.4775607|187.7592755|7.5150538|9.8384889|124.2595418 unknown
InChI: InChI=1S/C16H22O3/c1-10-7-12-8-16(3,9-17)15(18)14(12)11(2)13(10)5-6-19-4/h7,17H,5-6,8-9H2,1-4H3
charge 0 multiplicity 1
41 atoms
O  2.273864 -2.082387 -0.267631
O  4.769457 -1.642721 0.988017
O  -5.108412 -0.933118 0.017805
C  3.222397 0.166324 0.179844
C  2.492365 1.483825 0.576359
C  1.031335 1.249707 0.222183
C  0.788359 -0.098256 -0.159806
C  2.073369 -0.833286 -0.11558
C  4.102903 -0.394578 1.338898
C  4.0749 0.341506 -1.106936
C  -0.518472 -0.555446 -0.503498
C  -1.587572 0.388105 -0.463415
C  -0.027145 2.169637 0.256018
C  -1.338328 1.751309 -0.087886
C  -3.007367 -0.056774 -0.792478
C  -0.748761 -1.996698 -0.926936
C  -2.460287 2.775966 -0.069514
C  -3.765743 -0.546605 0.457496
C  -5.924154 -1.448584 1.115545
H  2.91079 2.360985 0.050319
H  2.596294 1.683637 1.662598
H  3.471309 -0.519962 2.24801
H  4.909692 0.324183 1.571555
H  4.522925 -0.621281 -1.40473
H  3.46216 0.724945 -1.943273
H  4.896467 1.057334 -0.918696
H  0.148972 3.212108 0.545658
H  -3.007565 -0.879197 -1.527953
H  -3.592578 0.765998 -1.23866
H  -1.565604 -2.466619 -0.349361
H  -1.041769 -2.050283 -1.993573
H  0.164543 -2.594492 -0.793051
H  -3.318322 2.444202 0.542931
H  -2.10797 3.73942 0.335058
H  -2.850651 2.963617 -1.088336
H  4.076314 -2.240278 0.584769
H  -3.828391 0.257836 1.225105
H  -3.245744 -1.4154 0.919935
H  -5.46677 -2.351671 1.573713
H  -6.899328 -1.715094 0.678741
H  -6.072481 -0.684016 1.908355
