program: Gaussian 09
title: 000134435
version: EM64L-G09RevD.01
frameworkgroup: C1[X(C27H23NO2)]
method: RPBEPBE
basis: SDD
operation: Freq
keyword: #p
keyword: freq=noraman
keyword: PBEPBE/SDD
title: #p freq=noraman PBEPBE/SDD
converged: YES YES NO NO
title: Mulliken charges:
elementType: O O N C C C C C C C C C C C C C C C C C C C C C C C C C C C H H H H H H H H H H H H H H H H H H H H H H H
charge: -0.263982 -0.263719 -0.006468 0.146520 0.144855 0.257614 0.275314 0.343923 -0.071304 -0.382662 -0.381961 -0.394217 -0.398844 -0.403120 -0.396131 -0.363332 -0.364303 -0.370468 -0.365778 -0.296962 0.308505 0.308615 -0.239152 -0.234328 -0.252493 -0.201170 -0.397473 -0.183419 -0.537739 -0.538081 0.260129 0.259813 0.270402 0.256727 0.236690 0.249884 0.249768 0.249423 0.241029 0.239586 0.260025 0.220019 0.222629 0.223886 0.235957 0.238476 0.227785 0.222100 0.222530 0.245360 0.223855 0.245058 0.220626
chargesum: 0.00000
title: Mulliken charges with hydrogens summed into heavy atoms:
elementType: O O N C C C C C C C C C C C C C C C C C C C C C C C C C C C
charge: -0.263982 -0.263719 -0.006468 0.146520 0.144855 0.257614 0.275314 0.343923 -0.071304 -0.122533 -0.122148 -0.123814 -0.142117 -0.166430 -0.146247 -0.113564 -0.114880 -0.129439 -0.126192 -0.036938 0.308505 0.308615 -0.019133 -0.011699 -0.028607 0.034787 -0.158997 0.044366 0.152251 0.151460
polarizability: 4.31926035e+02 -8.43192006e-01 3.86613420e+02 -5.86025507e+00 1.73008410e+00 2.11978665e+02
1716.lowfreq: -0.0001 0.0004 0.0007 4.6505 7.7026 8.6131 26.9310 33.9283 35.4915
frequency: 26.6972 33.8980 35.3331 41.2746 47.8898 60.6379 65.4234 67.1848 73.9064 101.0681 103.6880 130.2300 153.8885 160.6551 184.8831 189.9513 212.9095 232.3777 236.2795 238.5190 245.7040 261.9265 294.5783 323.7486 330.0678 361.1963 402.9980 404.8550 414.6788 419.9774 444.6437 447.5290 452.4461 496.0329 510.7426 528.7624 534.5134 571.9781 585.4261 609.3237 616.5714 628.2999 630.7292 632.7749 666.2993 686.8644 699.3841 728.6188 743.6415 747.7363 756.6821 761.4104 775.0869 792.6592 814.4455 819.7848 830.9874 839.6059 848.7115 851.1739 866.5444 896.0040 920.1166 948.4986 952.8910 955.7708 960.3252 968.6958 972.5895 973.2436 975.1315 986.7551 987.3836 988.9814 990.5507 996.1273 1001.9756 1007.6402 1028.8932 1041.1353 1083.5560 1085.6354 1112.3688 1113.0763 1114.5381 1115.1157 1140.9009 1157.1956 1158.1563 1162.7684 1170.2584 1180.0776 1184.7031 1190.4151 1218.5307 1233.6765 1233.9580 1273.7093 1284.6674 1292.5240 1305.3434 1306.8459 1314.2266 1325.4587 1358.4982 1362.7288 1374.2791 1405.0686 1419.9512 1420.5900 1433.9425 1437.0285 1437.8508 1446.2477 1466.6063 1467.0520 1472.2296 1472.4311 1480.1761 1494.7889 1498.9783 1540.4397 1552.3942 1567.8059 1569.9939 1574.0066 1582.2500 1607.3275 1612.9305 1617.3407 2960.0606 2960.2951 3048.2320 3048.4634 3118.5983 3119.2975 3125.2588 3125.4804 3126.3526 3135.7687 3136.8697 3138.4537 3139.2321 3139.5824 3141.7721 3149.2199 3156.4306 3162.1925 3162.5853 3163.0818 3166.7887 3167.7060 3169.4279
redmass: 5.7473 5.0470 5.1749 3.7952 4.0854 4.3006 4.2912 4.4064 3.7805 3.8068 3.6017 4.7337 4.3153 3.9929 3.6207 3.5040 3.1749 1.4778 3.7113 1.6548 3.4971 3.6139 4.8311 5.1229 4.4307 5.3576 3.3861 2.8555 3.0133 3.0219 4.3908 4.5447 4.3592 3.4954 3.2884 5.6020 2.7832 4.0663 4.3811 6.4608 6.3763 6.4944 7.0223 6.0825 5.4880 4.5915 1.6233 4.2601 2.2109 2.2066 4.7781 3.9737 3.0644 2.9479 1.3973 1.3369 1.9973 1.7126 1.2694 2.2521 5.9614 1.3350 1.4976 1.5640 1.9647 1.6548 2.1125 1.3745 2.4419 1.5902 1.4280 8.1771 8.7077 2.9832 1.7437 1.3521 2.7813 2.4434 2.2159 2.2469 1.6055 1.6609 1.2606 1.2623 1.3632 1.3812 3.1027 1.3327 1.3343 1.0787 1.0517 1.2956 1.2750 1.1226 3.1789 2.7816 3.0605 1.9684 3.6872 2.2013 2.1007 1.2926 1.8784 2.1604 5.2334 5.3959 6.7928 1.8722 3.7222 3.8648 2.2723 1.1960 1.1851 2.2698 1.0498 1.0497 1.0902 1.0820 2.2710 2.3611 2.4735 9.1283 5.5119 7.0592 6.5070 6.2587 6.0800 6.1059 6.1497 6.3900 1.0329 1.0329 1.1040 1.1040 1.0843 1.0884 1.0994 1.0994 1.0875 1.0887 1.0887 1.0884 1.0926 1.0883 1.0876 1.0959 1.0942 1.0952 1.1009 1.0956 1.0963 1.0964 1.1011
irintensity: 0.0417 0.3996 0.1885 2.3087 0.8445 2.2136 0.5585 0.4531 0.0784 3.1383 1.4287 3.5571 2.7127 4.0291 0.0184 2.5288 0.2423 0.6202 1.3844 0.0364 0.8288 1.3137 3.2736 2.9802 3.6518 2.1538 3.0789 0.2484 0.5400 1.0500 0.5449 0.4600 0.3753 0.2348 10.0643 48.7033 0.4230 14.9407 43.2752 0.6883 0.5527 1.4259 0.7951 0.6664 8.1361 1.0178 55.1433 0.0654 15.2156 37.4991 10.1151 3.3820 22.8708 42.8590 17.0762 8.7332 4.6443 77.1360 0.0971 16.0224 3.1906 0.8858 0.6918 1.2688 0.7402 1.0517 1.3550 2.9590 11.0653 6.3528 2.1172 36.6511 54.9474 0.2570 0.5569 1.9597 1.8243 23.7315 5.5359 4.6110 8.0690 5.4295 0.3193 0.5888 11.7450 8.3665 16.6988 3.9870 3.9137 2.2970 0.0130 207.2711 56.6983 1.3063 2.9124 262.2526 154.4062 9.1811 33.0384 18.6560 6.2371 1.7020 2.5259 6.4227 52.8517 0.6249 0.2812 31.5283 3.5126 0.7196 15.6380 14.4866 8.4434 54.2209 13.5013 13.3746 55.2201 90.2242 15.1149 67.4576 150.5870 33.7848 13.0009 4.3061 75.9245 24.2495 5.4488 13.9600 172.1916 44.8981 119.7540 36.5187 42.8720 44.0060 3.2851 24.8229 31.4251 30.6135 1.6612 7.9398 8.9136 5.2105 28.5950 5.2645 8.3259 37.7746 28.9198 13.9152 31.2578 10.6834 6.7014 7.8856 18.9979
temp: 298.150 k
press: 1.00000 atm
elementType: 8 8 7 6 6 6 6 6 6 6 6 6 6 6 6 6 6 6 6 6 6 6 6 6 6 6 6 6 6 6 1 1 1 1 1 1 1 1 1 1 1 1 1 1 1 1 1 1 1 1 1 1 1
symmnumber: 1
zpe: 1103676.7 jmol-1
zpe.correction: 0.420368 hartree
zpe.thermalcorrener: 0.446585 hartree
zpe.thermalcorrenthalpy: 0.447530 hartree
zpe.thermalcorrgfe: 0.362505 hartree
zpe.sumelectzpe: -1245.748397 hartree
zpe.sumelectthermal: -1245.722180 hartree
zpe.sumelectthermalent: -1245.721235 hartree
zpe.sumelectthermalfe: -1245.806260 hartree
dipole: -0.9926 -0.1646 1.6410
dipole: 1.9248
quadrupole: -131.4693 -177.0368 -166.8223
quadrupole: -2.9598 10.7860 6.0719
quadrupole: 26.9735 -18.5940 -8.3795 -2.9598 10.7860 6.0719
hfenergy: -1246.168765 hartree
pointgroup: C01 [X(C27H23N1O2)]
dipole: 0.4264896 -0.0606844 -0.6228266 debye
polarizability: 431.8028697|2.6067082|386.6308012|5.9402811|-4.4728223|212.0844492 unknown
InChI: InChI=1S/C27H23NO2/c1-29-23-15-11-21(12-16-23)26(22-13-17-24(30-2)18-14-22)27(20-8-4-3-5-9-20)25-10-6-7-19-28-25/h3-19H,1-2H3
charge 0 multiplicity 1
53 atoms
O  4.894585 -3.21136 0.43904
O  -4.672506 -3.60946 -0.348322
N  1.439182 3.03244 0.447251
C  -0.014654 -0.25474 -0.023044
C  -0.052698 1.138465 -0.042281
C  1.277218 -0.997242 0.102491
C  -1.24868 -1.093557 -0.114134
C  -1.290479 1.929291 0.23695
C  1.173932 1.942817 -0.350372
C  1.534445 -2.175339 -0.65926
C  -1.394622 -2.273781 0.672868
C  2.275147 -0.577806 1.022765
C  -2.293941 -0.776217 -1.021868
C  -1.607377 3.086775 -0.526038
C  -2.15864 1.573019 1.306092
C  2.742598 -2.879536 -0.532847
C  -2.539981 -3.080955 0.579396
C  3.489833 -1.278489 1.171369
C  -3.445957 -1.580299 -1.138163
C  1.99313 1.6262 -1.471821
C  3.729109 -2.432697 0.383708
C  -3.574569 -2.736409 -0.327052
C  -2.766538 3.843318 -0.251809
C  -3.312266 2.332151 1.587782
C  -3.627703 3.468933 0.805997
C  3.110161 2.431957 -1.767622
C  2.52641 3.798387 0.149378
C  3.392684 3.543972 -0.939072
C  5.943252 -2.796789 1.374625
C  -5.773446 -3.291382 -1.261057
H  0.775881 -2.533481 -1.363846
H  -0.599367 -2.552196 1.372833
H  2.086737 0.304005 1.644396
H  -2.19941 0.114717 -1.651108
H  -0.940401 3.393563 -1.339969
H  -1.91483 0.702673 1.924361
H  2.945519 -3.77662 -1.125734
H  -2.657188 -3.979321 1.192995
H  4.226856 -0.926874 1.899423
H  -4.224183 -1.301756 -1.855025
H  1.74151 0.763703 -2.095967
H  -2.994932 4.727633 -0.857955
H  -3.962041 2.042717 2.421659
H  -4.524466 4.059892 1.024808
H  3.744896 2.202133 -2.630334
H  2.701699 4.651673 0.816068
H  4.24908 4.198372 -1.131156
H  5.581127 -2.818214 2.421011
H  6.320401 -1.783834 1.133801
H  6.749684 -3.53361 1.24646
H  -6.222935 -2.307999 -1.022143
H  -6.515971 -4.087322 -1.103472
H  -5.437193 -3.298718 -2.316256
