program: Gaussian 09
title: 000134434
version: EM64L-G09RevD.01
frameworkgroup: C1[X(C25H19NO)]
method: RPBEPBE
basis: SDD
operation: Freq
keyword: #p
keyword: freq=noraman
keyword: PBEPBE/SDD
title: #p freq=noraman PBEPBE/SDD
converged: YES YES NO NO
title: Mulliken charges:
elementType: O N C C C C C C C C C C C C C C C C C C C C C C C C C H H H H H H H H H H H H H H H H H H H
charge: -0.463120 0.003536 -0.450335 0.002952 0.334250 0.176131 0.110141 0.143723 0.397059 0.441566 -0.403901 -0.367874 -0.404616 -0.411915 -0.363810 -0.383056 -0.255895 -0.272682 -0.330806 -0.337473 -0.239805 -0.228666 -0.260493 -0.225427 -0.343063 -0.379306 -0.241950 0.248722 0.274834 0.270965 0.240585 0.243748 0.363076 0.233683 0.292180 0.228525 0.231988 0.275521 0.232108 0.227284 0.229239 0.226721 0.226218 0.239517 0.240797 0.229121
chargesum: 0.00000
title: Mulliken charges with hydrogens summed into heavy atoms:
elementType: O N C C C C C C C C C C C C C C C C C C C C C C C C C
charge: -0.100044 0.003536 -0.201613 0.002952 0.334250 0.176131 0.110141 0.143723 0.397059 0.441566 -0.129067 -0.096909 -0.164031 -0.168167 -0.130126 -0.090876 -0.027371 -0.040694 -0.055285 -0.105365 -0.012521 0.000574 -0.033772 0.000791 -0.103546 -0.138508 -0.012829
polarizability: 2.85846076e+02 -9.42052249e+00 3.46265276e+02 -2.34067806e+01 -4.39566473e+00 1.82786858e+02
1716.lowfreq: -4.2265 -2.4548 -0.0006 -0.0004 0.0001 6.2721 28.2174 39.7617 47.9494
frequency: 28.1460 39.7440 47.9015 58.8534 61.5156 80.2388 102.2910 125.3334 145.7919 171.1019 209.4338 215.4278 251.5099 255.1184 281.7590 292.3552 295.2275 353.5303 366.3944 383.1683 402.5394 407.6976 428.7669 449.8222 454.5590 476.0027 497.7538 508.1662 545.7274 566.3995 577.1086 617.0324 618.3816 629.5737 639.8833 661.8647 665.5517 704.9545 705.4692 736.0626 745.1764 749.8510 756.2755 764.3096 796.2746 799.8835 821.4295 825.3037 851.9004 856.6564 882.9498 887.2702 896.1155 920.2902 927.8015 950.4279 958.5993 961.2910 963.1937 971.2040 982.6332 987.6625 989.7501 991.4007 993.3425 997.5751 1002.9319 1022.2264 1027.9764 1030.1107 1034.9639 1063.1788 1083.8040 1092.5059 1102.2351 1111.6311 1150.5994 1152.0959 1168.8443 1171.4734 1173.0326 1186.1156 1187.2141 1189.5081 1195.1466 1216.9407 1236.3736 1248.1282 1292.9638 1298.7418 1307.0906 1308.4903 1324.4544 1329.3241 1376.0694 1381.7231 1399.2899 1403.8272 1434.7830 1437.7861 1443.0041 1461.8896 1468.1903 1481.6219 1483.9364 1547.7978 1576.5526 1587.3247 1591.1272 1592.6032 1610.5817 1613.5383 1619.9208 3004.2517 3122.3751 3123.9336 3124.0387 3127.3421 3132.8315 3133.8497 3136.6967 3140.4075 3145.1735 3147.2212 3153.6819 3155.6346 3161.3791 3168.6056 3169.7976 3175.0225 3185.4718 3517.1406
redmass: 5.5963 4.5729 4.8658 5.0076 4.2016 4.5210 4.6057 4.6018 5.6733 4.6347 4.8229 4.9562 4.7564 5.5105 5.3306 4.4567 5.0176 5.6376 1.7036 1.4961 2.8381 5.1457 3.4358 3.1936 4.4715 4.6518 3.9000 4.9304 4.5523 3.6309 4.9604 6.4048 6.9470 5.4052 5.3408 6.9530 5.4570 2.0087 3.7350 4.5665 1.6970 3.1629 1.4647 2.0988 2.4876 2.1073 2.9671 2.3541 2.8214 1.3208 1.4853 1.4373 1.2583 2.2693 2.0165 2.0216 1.4544 2.5501 3.3735 1.4905 1.4040 1.4386 1.4194 4.3960 1.3397 6.6222 1.3689 5.2880 2.3303 2.2248 2.0050 2.1474 1.6116 1.7092 2.0300 1.8274 1.9095 1.4704 1.2552 1.2602 1.0576 1.9737 1.9799 1.8543 1.2354 1.3999 1.4712 1.8479 2.8907 1.7387 1.8089 1.8840 1.4947 1.4291 9.0484 8.6171 1.9214 4.0135 2.2171 2.2329 2.6164 1.9141 2.5309 2.4692 3.3077 7.3376 5.6217 6.4152 6.2196 6.9078 6.0064 7.1961 6.9806 1.0818 1.0870 1.0848 1.0853 1.0856 1.0883 1.0900 1.0905 1.0905 1.0943 1.0962 1.0955 1.0952 1.0995 1.0982 1.0982 1.0951 1.0946 1.0651
irintensity: 0.0724 0.0467 0.0323 0.1441 0.0777 0.7777 0.9425 0.0174 1.6087 0.7216 1.2234 2.5336 1.4547 2.8149 0.6784 0.2852 4.4622 4.3140 52.7763 85.2367 2.5210 2.1357 6.5127 0.5371 8.5954 5.9023 2.2259 0.8392 1.2295 0.5361 4.8758 0.0524 9.6005 41.0870 13.3392 1.8209 10.8250 51.3169 10.2514 5.7755 1.1441 6.7932 169.1632 14.7181 23.1505 1.9466 9.1628 20.7079 5.4240 0.4542 0.1834 3.7984 0.5931 6.9012 12.0786 7.1527 1.1181 3.2398 6.2300 2.7817 0.8574 0.5211 0.0970 0.8201 0.4464 1.9785 3.1709 17.6280 9.0232 10.1394 5.5066 8.2777 2.3873 0.5054 4.3983 0.2854 30.0110 2.1384 1.0002 1.9967 0.3371 6.2814 5.8203 1.3858 3.4636 0.8958 10.9739 0.2973 15.2126 0.9121 15.9610 12.1931 13.6116 25.1794 4.3199 0.8596 18.6088 1.7273 19.3444 16.1378 24.4571 7.9151 10.6663 9.2104 16.5616 9.1447 57.1175 2.4700 0.6192 0.6731 5.2195 4.9863 0.9742 7.1996 14.3024 2.5612 1.2756 1.6964 8.6098 25.2137 9.0727 8.2963 19.3981 27.5474 25.9976 30.6696 27.1216 29.7491 13.1507 5.1924 5.0254 28.0578
temp: 298.150 k
press: 1.00000 atm
elementType: 8 7 6 6 6 6 6 6 6 6 6 6 6 6 6 6 6 6 6 6 6 6 6 6 6 6 6 1 1 1 1 1 1 1 1 1 1 1 1 1 1 1 1 1 1 1
symmnumber: 1
zpe: 954208.8 jmol-1
zpe.correction: 0.363439 hartree
zpe.thermalcorrener: 0.384290 hartree
zpe.thermalcorrenthalpy: 0.385234 hartree
zpe.thermalcorrgfe: 0.313471 hartree
zpe.sumelectzpe: -1092.204729 hartree
zpe.sumelectthermal: -1092.183878 hartree
zpe.sumelectthermalent: -1092.182934 hartree
zpe.sumelectthermalfe: -1092.254697 hartree
dipole: -2.5455 1.1198 -0.5491
dipole: 2.8346
quadrupole: -159.7405 -146.3811 -152.2825
quadrupole: 11.9837 -4.7679 -3.3840
quadrupole: -6.9391 6.4203 0.5188 11.9837 -4.7679 -3.3840
hfenergy: -1092.5681682 hartree
pointgroup: C01 [X(C25H19N1O1)]
dipole: 0.9951522 0.4620228 0.1997944 debye
polarizability: 284.5709295|8.2295092|346.6244518|-25.3117865|4.3514546|183.7028277 unknown
InChI: InChI=1S/C25H19NO/c27-25(18-8-2-1-3-9-18,19-14-16-26-17-15-19)24-22-12-6-4-10-20(22)21-11-5-7-13-23(21)24/h1-17,24,27H
charge 0 multiplicity 1
46 atoms
O  -0.310295 -0.134434 -1.736633
N  -3.97616 -2.947731 0.371838
C  0.500932 -0.157797 0.609979
C  -0.759969 0.000867 -0.34349
C  1.55867 0.946713 0.465936
C  1.314994 -1.42749 0.289725
C  2.803476 0.388818 0.048661
C  2.652755 -1.071799 -0.06765
C  -1.401176 1.399528 -0.230807
C  -1.849159 -1.06329 -0.053341
C  1.45984 2.326573 0.72343
C  0.925849 -2.782725 0.293475
C  3.939866 1.203575 -0.143076
C  3.595547 -2.061515 -0.420554
C  -2.098478 1.781812 0.942625
C  -1.288622 2.324232 -1.295812
C  2.600883 3.146346 0.53399
C  1.873791 -3.776274 -0.062254
C  -2.638182 -1.543484 -1.127688
C  -2.158291 -1.551136 1.241148
C  3.828911 2.592177 0.096995
C  3.196697 -3.418012 -0.418089
C  -2.659543 3.072192 1.056798
C  -1.859168 3.612572 -1.185682
C  -3.67335 -2.46895 -0.87343
C  -3.212459 -2.478492 1.402527
C  -2.542844 3.994935 -0.009237
H  0.129554 -0.177955 1.652616
H  0.522646 2.772973 1.066825
H  -0.089495 -3.080091 0.569261
H  4.895204 0.771536 -0.461665
H  4.621965 -1.78776 -0.688732
H  0.296137 -0.919914 -1.783758
H  -2.219192 1.076087 1.771802
H  -0.747908 2.023326 -2.195916
H  2.529976 4.221997 0.729927
H  1.577917 -4.831012 -0.057841
H  -2.438017 -1.190638 -2.142984
H  -1.591183 -1.243123 2.125955
H  4.698951 3.24301 -0.045232
H  3.916041 -4.198697 -0.689651
H  -3.193911 3.352852 1.971353
H  -1.764564 4.31838 -2.018662
H  -4.29423 -2.850331 -1.692115
H  -3.460816 -2.870026 2.395843
H  -2.983391 4.994675 0.075591
