program: Gaussian 09
title: 000134423
version: EM64L-G09RevD.01
frameworkgroup: C1[X(C25H21NO)]
method: RPBEPBE
basis: SDD
operation: Freq
keyword: #p
keyword: freq=noraman
keyword: PBEPBE/SDD
title: #p freq=noraman PBEPBE/SDD
converged: YES YES NO NO
title: Mulliken charges:
elementType: O N C C C C C C C C C C C C C C C C C C C C C C C C C H H H H H H H H H H H H H H H H H H H H H
charge: -0.474506 -0.007369 -0.039425 -0.481258 0.417568 0.468922 0.461363 0.444356 -0.358642 -0.389659 -0.438195 -0.434246 -0.385531 -0.441891 -0.352290 -0.470988 -0.259297 -0.224546 -0.233194 -0.230546 -0.253522 -0.240209 -0.177385 -0.242160 -0.244839 -0.239526 -0.362913 0.236195 0.362410 0.226729 0.269940 0.231385 0.252802 0.299217 0.288804 0.270329 0.239125 0.225590 0.223221 0.223867 0.230733 0.225189 0.229382 0.227692 0.226875 0.226482 0.231566 0.242395
chargesum: 0.00000
title: Mulliken charges with hydrogens summed into heavy atoms:
elementType: O N C C C C C C C C C C C C C C C C C C C C C C C C C
charge: -0.112096 -0.007369 -0.039425 -0.245063 0.417568 0.468922 0.461363 0.444356 -0.131913 -0.119719 -0.206810 -0.181445 -0.086313 -0.153087 -0.081962 -0.231863 -0.033708 -0.001325 -0.009327 0.000187 -0.028332 -0.010827 0.050307 -0.015284 -0.018357 -0.007960 -0.120518
polarizability: 3.18208946e+02 2.95708663e+00 2.44780723e+02 2.62715976e+00 -3.01871348e+00 2.27545505e+02
1716.lowfreq: -6.0441 -0.0009 -0.0008 -0.0003 1.0476 8.6040 26.5155 32.9813 41.3506
frequency: 26.4741 32.9786 41.3373 50.4115 54.7273 60.0437 63.2637 72.0272 88.0075 143.6310 168.6788 204.4983 232.0422 242.8230 249.9471 255.3967 278.1478 286.1220 318.3807 354.0255 393.1408 401.5352 403.1516 406.0184 447.0698 456.0758 466.6357 485.6102 505.9213 542.1304 578.5252 609.6524 615.0273 616.7440 617.2589 625.0380 647.1952 683.6650 702.6392 708.6612 709.7261 725.5227 735.6951 750.6841 762.6623 794.1411 807.6581 832.2075 834.8410 851.1517 858.3320 860.3869 902.4925 913.2776 919.1575 929.5229 937.2685 942.8302 953.6753 978.1295 981.7653 983.8296 990.4104 990.7620 991.0453 995.6304 997.7058 998.9079 1001.8783 1003.9290 1021.2925 1028.4734 1030.0508 1031.8406 1033.9068 1081.7114 1086.2073 1091.0846 1114.9808 1158.5644 1170.5054 1172.2117 1173.3464 1173.7787 1180.3798 1191.8477 1193.0381 1195.2247 1206.2894 1208.1753 1240.4439 1287.3051 1305.7268 1315.2297 1327.6141 1332.7323 1334.8553 1343.3867 1378.9686 1379.5799 1385.0515 1405.2109 1435.8410 1438.6579 1442.1697 1455.0099 1479.6501 1483.2720 1484.2539 1555.2336 1576.1196 1587.9091 1590.4468 1592.2939 1607.0618 1612.1205 1614.2104 3009.2977 3109.3536 3118.0516 3123.4181 3123.4910 3124.8802 3128.1786 3130.8667 3132.0583 3138.3637 3139.3541 3145.0076 3148.4970 3150.9109 3153.7500 3159.7791 3164.4321 3164.9096 3169.7769 3174.4176 3464.3256
redmass: 4.4407 4.9904 4.7419 4.2142 4.7866 4.2906 4.5589 4.5558 4.8806 5.1589 5.2462 4.9573 4.4925 4.5627 4.3417 4.9618 4.8581 4.6115 6.2604 6.5847 2.6276 2.6231 2.8740 2.8535 2.4202 1.7680 3.6466 3.5381 4.0595 3.8283 5.8987 7.0497 5.9380 6.3852 6.3905 5.1533 5.7679 6.2440 1.7415 1.8506 1.8744 1.9347 2.2254 2.1420 1.9541 2.4647 2.6401 2.6141 4.1392 1.2594 1.2540 1.2613 1.7843 1.9442 1.6671 1.4626 1.7379 2.2152 1.7226 1.3906 1.4194 1.4725 5.3478 4.8347 5.6483 1.3385 1.4551 1.3516 1.3905 3.1467 3.6862 2.2810 2.6683 2.4497 2.5502 1.6332 1.6112 1.6581 1.6560 2.0744 1.9247 1.1164 1.0771 1.0730 2.6553 1.1288 1.1370 1.1412 1.5559 2.2446 1.4047 1.6265 3.7701 1.9734 1.3308 1.3363 1.3818 1.3465 6.7627 7.9722 5.7716 1.9787 2.2415 2.2096 2.1255 1.9512 2.1904 2.2433 2.2402 5.6025 6.0754 5.9982 5.8910 6.1583 6.0010 6.0708 6.0036 1.0829 1.0877 1.0894 1.0848 1.0847 1.0863 1.0874 1.0881 1.0882 1.0924 1.0918 1.0937 1.0961 1.0923 1.0955 1.0981 1.1003 1.1014 1.0986 1.0966 1.0653
irintensity: 0.5108 0.6357 0.0253 0.0663 0.8432 0.4155 0.3027 0.8740 0.4298 0.1026 1.5630 0.8609 1.4931 0.8533 0.0854 0.2474 4.0173 2.7909 2.1263 3.3988 13.5379 10.5361 0.4003 0.9488 49.7638 121.3375 14.9035 3.0315 0.3683 4.0884 14.6955 8.7059 4.3194 0.7634 0.3635 35.1778 1.4031 6.5907 53.7207 46.2179 52.9432 38.3964 57.0063 46.2323 35.9676 2.4652 11.9408 12.1456 2.8686 0.1160 0.0728 0.2681 5.3481 16.9361 3.8825 2.6149 3.9785 9.8053 7.3032 0.0960 0.3646 0.6967 1.0466 0.7518 0.8175 0.3459 2.6406 0.6807 1.6462 9.3489 9.6604 11.9707 2.1634 5.1086 14.3817 1.2308 23.7421 0.2512 3.5732 24.4724 1.5160 0.6118 0.1724 0.6369 0.6971 1.9218 2.7187 0.8533 7.7971 0.2679 0.7353 5.0179 9.3102 8.8250 19.2125 7.3731 28.0410 12.3193 2.1103 0.3242 0.2541 20.9746 14.9589 13.4385 2.9921 21.7501 15.7507 15.8526 28.8270 5.7762 0.4697 3.0712 1.1446 1.0048 8.5368 5.8689 7.5821 11.0014 8.8890 28.7513 3.6607 0.9457 1.1034 0.6312 5.9116 6.0568 26.5757 8.8936 39.5990 27.5148 19.9812 17.8061 23.3978 32.0016 21.0526 18.7664 8.5634 53.7014
temp: 298.150 k
press: 1.00000 atm
elementType: 8 7 6 6 6 6 6 6 6 6 6 6 6 6 6 6 6 6 6 6 6 6 6 6 6 6 6 1 1 1 1 1 1 1 1 1 1 1 1 1 1 1 1 1 1 1 1 1
symmnumber: 1
zpe: 1009506.3 jmol-1
zpe.correction: 0.384501 hartree
zpe.thermalcorrener: 0.406654 hartree
zpe.thermalcorrenthalpy: 0.407598 hartree
zpe.thermalcorrgfe: 0.331735 hartree
zpe.sumelectzpe: -1093.358359 hartree
zpe.sumelectthermal: -1093.336206 hartree
zpe.sumelectthermalent: -1093.335261 hartree
zpe.sumelectthermalfe: -1093.411124 hartree
dipole: 0.5626 1.7744 -1.3560
dipole: 2.3030
quadrupole: -142.7728 -156.5552 -152.1994
quadrupole: 4.3675 -7.7017 4.6551
quadrupole: 7.7364 -6.0461 -1.6903 4.3675 -7.7017 4.6551
hfenergy: -1093.7428592 hartree
pointgroup: C01 [X(C25H21N1O1)]
dipole: -0.1807395 0.7028597 0.5424767 debye
polarizability: 317.6818483|-6.985056|245.2560721|2.3828112|3.1036574|227.5972531 unknown
InChI: InChI=1S/C25H21NO/c27-25(22-15-8-3-9-16-22,23-17-10-18-26-19-23)24(20-11-4-1-5-12-20)21-13-6-2-7-14-21/h1-19,24,27H
charge 0 multiplicity 1
48 atoms
O  -0.204621 -0.252086 1.850873
N  -2.822714 -2.368055 -1.746704
C  -0.13222 -0.608617 0.421355
C  0.054159 0.713783 -0.444959
C  1.029955 -1.611293 0.281599
C  1.446849 1.352523 -0.367249
C  -1.054864 1.727924 -0.101604
C  -1.443384 -1.332245 0.009413
C  1.704331 -1.801877 -0.949481
C  1.384858 -2.420584 1.388833
C  1.913983 2.067931 -1.499947
C  -2.268752 1.738692 -0.837476
C  2.267971 1.305531 0.788291
C  -0.903505 2.654678 0.965908
C  -2.430414 -1.655393 0.969377
C  -1.689011 -1.733494 -1.330767
C  2.712968 -2.781751 -1.072219
C  2.396195 -3.398704 1.267597
C  3.166232 2.719652 -1.48642
C  -3.30621 2.639462 -0.512559
C  3.523481 1.953414 0.803328
C  -1.94436 3.553585 1.295856
C  -3.607838 -2.32131 0.562419
C  3.063226 -3.586809 0.035454
C  3.978607 2.664789 -0.330109
C  -3.151422 3.546983 0.56109
C  -3.769404 -2.648454 -0.801297
H  -0.108106 0.416114 -1.497922
H  -0.820113 0.526017 1.9362
H  1.468981 -1.177488 -1.818206
H  0.872393 -2.267071 2.342399
H  1.28719 2.120775 -2.399812
H  -2.402712 1.039971 -1.671105
H  1.926811 0.746303 1.664768
H  0.050895 2.71099 1.501602
H  -2.263685 -1.396652 2.019021
H  -0.946585 -1.559406 -2.118822
H  3.228844 -2.910381 -2.030291
H  2.662046 -4.01415 2.134685
H  3.507885 3.264982 -2.373576
H  -4.232647 2.634179 -1.097618
H  4.148414 1.8984 1.702145
H  -1.805481 4.265127 2.11769
H  -4.386197 -2.582236 1.286808
H  3.84678 -4.346887 -0.059833
H  4.953197 3.165646 -0.31524
H  -3.955498 4.247401 0.812596
H  -4.67131 -3.15591 -1.161987
