program: Gaussian 09
title: 000134411
version: EM64L-G09RevD.01
frameworkgroup: C1[X(C15H22Cl2N2O2)]
method: RPBEPBE
basis: SDD
operation: Freq
keyword: #p
keyword: freq=noraman
keyword: PBEPBE/SDD
title: #p freq=noraman PBEPBE/SDD
converged: YES YES NO NO
title: Mulliken charges:
elementType: Cl Cl O O N N C C C C C C C C C C C C C C C H H H H H H H H H H H H H H H H H H H H H H
charge: -0.086370 -0.086924 -0.270435 -0.269864 -0.138599 -0.457398 -0.494539 0.307619 -0.327448 -0.336121 0.155811 -0.464161 -0.570771 -0.608872 0.499033 -0.338410 -0.490145 -0.239836 0.221583 -0.683998 -0.781488 0.241799 0.237731 0.232572 0.232203 0.227126 0.252283 0.322772 0.264897 0.275342 0.254371 0.332067 0.245586 0.220539 0.302613 0.207247 0.208160 0.232153 0.231899 0.209576 0.211602 0.257830 0.260966
chargesum: 0.00000
title: Mulliken charges with hydrogens summed into heavy atoms:
elementType: Cl Cl O O N N C C C C C C C C C C C C C C C
charge: -0.086370 -0.086924 -0.270435 -0.269864 -0.138599 -0.154785 -0.015010 0.307619 0.137327 0.143288 0.155811 -0.141389 -0.030532 -0.022433 0.499033 -0.092824 -0.269606 0.175570 0.221583 -0.010370 -0.051090
polarizability: 2.45415573e+02 1.93409432e+01 2.44806066e+02 -6.57731235e+00 -7.87244095e+00 1.56739198e+02
1716.lowfreq: -5.1150 -3.5628 -0.0022 -0.0022 -0.0020 5.1227 15.9608 23.5414 32.1331
frequency: 15.8291 23.4723 32.1142 37.5066 42.1483 59.7960 66.2319 90.1811 95.3662 97.1689 104.4498 109.5773 120.7178 143.4402 172.0439 181.2755 195.5186 215.4627 226.8094 244.4147 263.1402 274.6139 283.1390 324.8475 371.5038 378.9334 381.1785 422.0930 440.0377 448.1170 508.9097 540.2507 566.6663 599.5733 607.6241 637.3528 644.9072 655.6988 668.9632 730.6662 745.8027 764.4434 775.6405 786.7380 797.7252 834.0861 845.6594 903.8182 915.7483 929.6055 935.2453 956.4127 984.0079 997.4802 1007.4899 1011.0767 1036.7526 1040.1805 1060.0252 1062.3724 1085.2676 1111.6519 1117.2399 1127.4770 1137.2821 1168.0361 1183.9580 1202.7630 1225.3692 1237.7842 1251.6443 1257.8627 1264.4198 1264.9456 1274.9420 1278.7378 1297.6546 1310.2500 1348.9807 1362.3553 1368.4112 1374.0624 1386.1416 1390.3947 1401.2082 1433.0114 1448.4263 1452.3473 1460.5080 1462.1072 1464.5605 1470.5201 1474.5148 1477.2490 1482.0064 1483.5557 1493.7051 1508.5949 1596.9149 1615.5643 1625.2995 2908.6643 2924.3241 2946.4562 2953.7690 2995.0235 2997.3902 3004.1369 3011.8187 3050.2072 3051.8985 3062.6237 3065.1834 3094.7144 3095.2834 3099.5387 3105.9929 3116.7113 3144.3224 3150.2359 3166.7894 3213.6482 3536.9367
redmass: 8.0699 5.9120 10.3529 6.1458 5.1638 3.8675 1.2970 2.4046 3.7159 3.0981 3.7437 2.3955 2.4028 2.5575 4.7879 3.8020 4.6418 6.7153 3.0335 1.2894 3.3759 3.7866 3.1038 4.6901 4.5252 4.8787 3.8410 3.6036 3.4599 3.2600 3.8942 4.4772 3.0883 4.7679 3.3424 1.2802 4.2046 5.9014 6.2944 3.7980 4.7310 3.9285 1.1778 1.1560 1.4480 1.1175 4.4258 3.2262 1.3995 2.3565 2.5528 2.8086 1.7425 1.5058 1.6921 1.5623 2.8400 1.6259 3.1079 3.4834 2.0634 1.9991 2.0554 1.8047 1.4391 1.5794 1.4017 1.7841 2.6217 1.4312 1.4517 1.5567 1.2800 1.2156 1.2231 1.8749 1.3086 1.3133 1.6855 1.3452 1.3720 1.3634 3.2985 1.2802 1.3103 3.0756 1.0450 1.1236 1.1345 1.0415 1.0934 1.1126 1.4275 1.1011 1.2584 1.0989 1.2738 2.3476 7.8835 4.5008 6.3488 1.0688 1.0696 1.0680 1.0553 1.0362 1.0362 1.0891 1.1075 1.0626 1.0921 1.0584 1.0874 1.0989 1.0995 1.0990 1.1014 1.0899 1.1122 1.1122 1.0933 1.0909 1.0765
irintensity: 0.0174 0.5614 1.1363 1.3734 0.2263 11.5798 0.5798 1.3411 2.7716 0.1218 1.3279 4.7021 4.8535 0.8970 0.2941 0.8454 8.8581 5.0543 2.3675 0.4892 1.1575 1.7024 0.5257 3.8224 7.8140 1.2852 5.7006 2.7610 2.5354 5.2223 23.5145 11.8943 7.8972 4.4456 2.8624 47.3810 15.9943 106.8950 77.8922 0.6072 5.9404 3.3860 4.7794 7.9275 67.9147 0.3025 8.6906 44.2275 2.5817 3.1626 3.9464 9.9252 30.5317 7.0166 16.1380 16.5654 79.6051 13.6342 15.5133 3.9442 45.4514 19.3828 27.0986 21.2067 5.3799 35.2808 8.4579 105.6391 242.1654 34.8366 10.9394 15.5139 15.3802 3.6687 1.1534 35.8469 3.1054 13.9427 18.8115 2.2290 1.8697 4.7348 154.3099 21.8052 60.9977 33.0428 15.6102 13.5716 32.8246 12.1312 23.0240 22.0686 116.1913 7.2007 33.3889 11.7171 3.9269 291.3008 64.1631 141.9597 2.3147 30.3889 61.8576 55.6526 47.6816 16.5421 24.7303 13.3035 35.4163 13.5382 11.8573 14.7222 35.3836 29.5440 16.1444 11.7500 32.8658 20.5704 5.6864 14.3236 15.8314 8.5506 12.4806
temp: 298.150 k
press: 1.00000 atm
elementType: 17 17 8 8 7 7 6 6 6 6 6 6 6 6 6 6 6 6 6 6 6 1 1 1 1 1 1 1 1 1 1 1 1 1 1 1 1 1 1 1 1 1 1
symmnumber: 1
zpe: 918046.8 jmol-1
zpe.correction: 0.349666 hartree
zpe.thermalcorrener: 0.373485 hartree
zpe.thermalcorrenthalpy: 0.374429 hartree
zpe.thermalcorrgfe: 0.292202 hartree
zpe.sumelectzpe: -1763.249028 hartree
zpe.sumelectthermal: -1763.225209 hartree
zpe.sumelectthermalent: -1763.224265 hartree
zpe.sumelectthermalfe: -1763.306492 hartree
dipole: -7.5612 2.8221 -1.3661
dipole: 8.1855
quadrupole: -132.8789 -125.3335 -150.6626
quadrupole: 1.2335 -2.4527 -17.8732
quadrupole: 3.4128 10.9581 -14.3710 1.2335 -2.4527 -17.8732
hfenergy: -1763.598694 hartree
pointgroup: C01 [X(C15H22Cl2N2O2)]
dipole: 1.1704308 2.9682363 -0.4367104 debye
polarizability: 237.9489737|-17.1094823|243.093756|28.4744161|-10.8269645|165.9181072 unknown
InChI: InChI=1S/C15H22Cl2N2O2/c1-3-21-15-5-4-14(18-12(2)20)10-13(15)11-19(8-6-16)9-7-17/h4-5,10,18H,3,6-9,11H2,1-2H3
charge 0 multiplicity 1
43 atoms
Cl -2.724166 -4.075317 -2.887888
Cl -0.566896 -3.121892 3.74168
O  -1.757573 2.768524 -0.491975
O  2.662041 -1.932218 0.803801
N  -1.595694 -1.423586 0.097447
N  3.267955 0.297371 0.37086
C  -1.724972 -0.013244 -0.325773
C  -0.435437 0.79362 -0.191719
C  -2.434387 -2.380522 -0.652668
C  -1.512411 -1.644114 1.559645
C  -0.480692 2.214705 -0.279278
C  0.802612 0.157601 0.005587
C  -1.634455 -2.914775 -1.849858
C  -0.54229 -2.794798 1.871746
C  1.996952 0.909847 0.1437
C  0.708267 2.973444 -0.162215
C  1.940275 2.321235 0.053616
C  -1.870182 4.23931 -0.55186
C  3.548032 -1.03146 0.68497
C  -3.34748 4.564751 -0.754597
C  5.030233 -1.34424 0.880717
H  -2.534593 0.515609 0.228507
H  -2.040402 0.000853 -1.387759
H  -3.382037 -1.922462 -1.010235
H  -2.716368 -3.225395 0.001103
H  -2.507488 -1.860108 2.010962
H  -1.129547 -0.723405 2.032746
H  0.831163 -0.9298 0.056303
H  -1.321806 -2.114136 -2.536835
H  -0.767453 -3.511976 -1.533467
H  -0.850793 -3.747676 1.414689
H  0.500202 -2.555816 1.617428
H  0.690545 4.064532 -0.230601
H  2.854079 2.920053 0.158425
H  4.070157 0.929648 0.334193
H  -1.255252 4.62088 -1.393091
H  -1.486632 4.675895 0.393468
H  -3.72103 4.114925 -1.690257
H  -3.951326 4.176894 0.083342
H  -3.489543 5.659273 -0.811451
H  5.694451 -0.468346 0.777481
H  5.335483 -2.108668 0.14512
H  5.171958 -1.783317 1.883093
