program: Gaussian 09
title: 000134408
version: EM64L-G09RevD.01
frameworkgroup: C1[X(C10H11NO3)]
method: RPBEPBE
basis: SDD
operation: Freq
keyword: #p
keyword: freq=noraman
keyword: PBEPBE/SDD
title: #p freq=noraman PBEPBE/SDD
converged: YES YES NO NO
title: Mulliken charges:
elementType: O O O N C C C C C C C C C C H H H H H H H H H H H
charge: -0.331416 -0.231328 -0.252785 -0.351797 0.208816 0.288419 -0.329421 -0.366797 0.163636 -0.263338 -0.200700 -0.796571 0.292030 -0.603099 0.244316 0.257318 0.233120 0.235650 0.233749 0.245145 0.260443 0.333410 0.236958 0.268325 0.225916
chargesum: 0.00000
title: Mulliken charges with hydrogens summed into heavy atoms:
elementType: O O O N C C C C C C C C C C
charge: -0.331416 -0.231328 -0.252785 -0.018387 0.208816 0.288419 -0.085105 -0.109479 0.163636 -0.030218 0.034950 -0.057233 0.292030 0.128100
polarizability: 1.71831809e+02 -9.71664244e+00 1.30616093e+02 1.35518583e+01 4.44559505e+00 7.44132717e+01
1716.lowfreq: -7.6531 -0.0004 -0.0001 0.0008 2.3737 12.1399 32.7774 55.7380 69.3274
frequency: 32.5930 55.7337 69.3063 93.9881 108.3717 130.8509 166.2371 175.8770 226.2105 233.9251 265.1789 318.1719 350.5328 408.3193 426.2211 467.7077 505.2121 577.7084 586.5272 594.5062 602.6919 640.8314 677.7114 699.1029 750.5486 769.7428 806.0952 873.1696 881.4125 947.1871 955.7037 990.2620 1022.7334 1034.0914 1055.9221 1067.4358 1122.7656 1125.7320 1149.9715 1171.4292 1175.6936 1227.3017 1260.9674 1275.9300 1368.3162 1381.8108 1427.6547 1430.5306 1449.9200 1457.7880 1465.9046 1471.6746 1482.3175 1517.2168 1563.9256 1598.0751 1611.8563 1727.5483 2982.3870 2987.5786 3062.2213 3074.1836 3115.3388 3126.1998 3137.6911 3152.5502 3167.3423 3177.2649 3578.9905
redmass: 4.2473 3.6780 4.4459 2.1425 1.5512 5.2912 4.1650 1.0520 4.0951 5.0146 5.8456 4.8581 4.8632 5.9965 3.6755 4.3385 3.6418 1.6154 2.2209 2.8354 6.4355 6.6910 6.5555 5.2279 3.0355 1.4047 4.6745 1.9927 2.5098 2.3656 1.3849 1.3398 1.8221 2.8171 5.1400 2.1701 1.8263 1.2924 1.7146 2.2484 1.1484 2.5530 3.1361 1.6224 1.2764 8.6324 2.0947 1.1731 1.1544 1.4441 1.0506 1.8416 1.0673 1.4539 5.8379 8.1496 6.4915 9.8826 1.0355 1.0376 1.1023 1.0970 1.0985 1.0991 1.0858 1.0903 1.0943 1.0999 1.0772
irintensity: 4.1608 11.2937 5.8436 0.1744 1.6608 0.7867 0.5701 0.2668 0.7029 4.0912 2.3601 4.7149 22.9498 2.2118 1.3706 3.2358 8.5264 43.9632 95.1860 2.9737 1.0403 4.5519 34.9413 5.3535 13.0620 64.5466 15.8935 34.7431 58.3982 25.9199 3.3186 0.3521 2.3970 4.6343 153.7294 114.3054 94.3252 1.5355 77.5073 247.7305 33.8082 3.0906 145.9427 57.1265 38.8979 16.0561 50.3254 24.3702 79.3142 82.6245 20.8490 19.3368 19.9343 138.1038 86.9094 127.9470 40.1977 292.1326 76.8780 3.5289 35.0640 10.8045 5.2886 13.6266 1.3391 11.6293 18.1626 12.5502 47.4028
temp: 298.150 k
press: 1.00000 atm
elementType: 8 8 8 7 6 6 6 6 6 6 6 6 6 6 1 1 1 1 1 1 1 1 1 1 1
symmnumber: 1
zpe: 505983.9 jmol-1
zpe.correction: 0.192719 hartree
zpe.thermalcorrener: 0.206589 hartree
zpe.thermalcorrenthalpy: 0.207533 hartree
zpe.thermalcorrgfe: 0.151213 hartree
zpe.sumelectzpe: -667.067728 hartree
zpe.sumelectthermal: -667.053858 hartree
zpe.sumelectthermalent: -667.052914 hartree
zpe.sumelectthermalfe: -667.109235 hartree
dipole: 1.2892 -0.3428 -1.2303
dipole: 1.8147
quadrupole: -59.5404 -73.8621 -87.5135
quadrupole: 3.6286 5.0238 3.2415
quadrupole: 14.0983 -0.2234 -13.8749 3.6286 5.0238 3.2415
hfenergy: -667.2604474 hartree
pointgroup: C01 [X(C10H11N1O3)]
dipole: -0.4985676 0.0920339 -0.5026968 debye
dipolederiv: -2.0997687 0.0294662 -0.2074443 0.4043653 -0.3137811 0.1049629 -0.3184551 0.1147032 -0.5193107 -0.8490129 0.2512992 0.1567093 0.0608915 -0.6793054 0.0179225 0.1405689 -0.0553645 -0.3644416 -0.7478196 0.032363 0.0877354 0.0521366 -0.3347243 0.0325338 -0.0390421 -0.0316539 -0.9922469 -1.3968292 0.055436 0.2318892 -0.0223566 -0.4793645 0.03487 0.2428227 -0.0114097 -0.4239848 -0.3102397 0.2497859 0.0098628 0.107633 -0.7252494 0.0888451 0.1286741 0.0910736 -0.0360764 1.3933583 0.135622 -0.0134937 -0.1400003 0.2794555 0.0242944 -0.3146888 -0.0823867 0.048795 0.0336583 -0.2015785 -0.0159937 0.0281502 0.1354553 -0.070824 -0.0513879 0.0009992 -0.095681 -0.427292 0.0780973 -0.0404189 0.2668492 -0.0174418 -0.0646409 -0.0769432 -0.0526226 -0.1217821 0.9093458 -0.3085939 -0.2551228 -0.1546147 1.493261 -0.2285192 -0.2486131 -0.217628 0.2901116 0.0650485 0.0024097 -0.0672852 -0.0488546 -0.3203562 0.0122495 -0.0520319 0.0311208 -0.1601376 0.1672677 0.0152371 -0.0419908 -0.0123485 0.1599884 -0.0534812 -0.0612792 -0.0737935 -0.10069 -0.1246817 -0.2366873 0.1170824 -0.1442649 -0.3736881 0.1549818 0.107987 0.1868194 -0.0361521 2.5284648 -0.1491771 -0.1319743 -0.5028458 0.4267495 -0.1119109 0.2469388 0.0278335 1.4750507 0.5817683 -0.0574102 0.0307114 -0.0592122 0.2820721 -0.0119674 0.3130854 -0.0384387 0.0391405 0.0554081 -0.0739839 0.03095 -0.0848056 -0.0177409 0.0559984 0.0426865 0.0547365 0.1180505 0.0644936 -0.0719856 0.0443615 -0.0597313 -0.0045099 0.0457009 0.0304968 0.0508873 0.1450189 -0.1099664 0.0230659 0.0551857 0.0036807 0.0856517 0.0179624 0.0632308 0.0150824 0.1473036 0.0350804 0.0929933 -0.0025585 0.1035201 -0.0535035 0.0335732 0.0069998 0.0383676 0.1450958 -0.0339787 -0.0478751 -0.0897397 -0.0142556 0.0998912 0.0145097 -0.0963747 -0.0139034 0.0368056 0.0844861 0.0091513 0.0587296 0.0083598 0.0656536 -0.0745426 0.0652068 -0.0370701 -0.0491842 0.0334252 0.136229 -0.0073056 0.0632354 -0.0296661 0.0210759 0.0143503 0.0034962 0.1107451 0.2083606 0.056594 -0.0322506 0.1131528 0.3304221 -0.0166047 -0.0961956 0.0113173 0.1741564 -0.0346546 0.04874 -0.0066561 0.15178 -0.1215758 -0.060236 -0.0302423 -0.0721649 0.0962691 0.1475516 0.0062288 0.0701019 0.014635 0.1204208 -0.013317 -0.0399536 0.0043925 -0.0335537 -0.1734741 -0.075427 0.018915 -0.1350996 -0.0081142 0.0465634 0.0221594 0.0556068 0.1066986 unknown
polarizability: 169.6158975|-15.449369|129.7603896|-12.3158338|-12.8020191|77.4848867 unknown
InChI: InChI=1S/C10H11NO3/c1-7(12)8-5-3-4-6-9(8)14-10(13)11-2/h3-6,11H,1-2H3
charge 0 multiplicity 1
25 atoms
O  0.952262 0.94029 -0.678885
O  0.815041 -1.832565 -0.321395
O  1.729114 0.410456 1.508283
N  3.126859 0.363007 -0.388709
C  -1.053003 -0.345632 0.095373
C  -0.410076 0.861158 -0.327746
C  -2.442756 -0.26673 0.400186
C  -1.136453 2.061681 -0.473662
C  -0.351325 -1.672224 0.14775
C  -3.171854 0.929204 0.263346
C  -2.516008 2.098549 -0.188556
C  -1.085257 -2.864131 0.759603
C  1.947435 0.515196 0.283049
C  4.355517 -0.056399 0.289091
H  -2.963941 -1.166776 0.739612
H  -0.596032 2.954979 -0.800437
H  -4.239914 0.951666 0.502632
H  -3.070729 3.035907 -0.303705
H  -1.973341 -3.143764 0.162244
H  -1.425409 -2.642679 1.787468
H  -0.393843 -3.719814 0.781954
H  3.083112 0.388019 -1.407502
H  4.640343 -1.086159 0.003325
H  4.171898 -0.035037 1.374758
H  5.189861 0.628898 0.053923
