program: Gaussian 09
title: 000134386
version: EM64L-G09RevD.01
frameworkgroup: C1[X(C15H21NO2)]
method: RPBEPBE
basis: SDD
operation: Freq
keyword: #p
keyword: freq=noraman
keyword: PBEPBE/SDD
title: #p freq=noraman PBEPBE/SDD
converged: YES YES NO NO
title: Mulliken charges:
elementType: O O N C C C C C C C C C C C C C C C H H H H H H H H H H H H H H H H H H H H H
charge: -0.470504 -0.452414 -0.176367 -0.115304 -0.515869 -0.209316 0.351887 -0.182046 -0.459604 -0.408738 -0.440658 -0.402751 0.060172 -0.191828 -0.351237 0.136174 -0.334541 -0.679756 0.220284 0.239744 0.209420 0.212502 0.215073 0.209510 0.221298 0.204999 0.203395 0.214118 0.211286 0.196804 0.227975 0.207140 0.204138 0.242190 0.247564 0.218686 0.205552 0.359799 0.371221
chargesum: 0.00000
title: Mulliken charges with hydrogens summed into heavy atoms:
elementType: O O N C C C C C C C C C C C C C C C
charge: -0.110705 -0.081194 -0.176367 0.104979 -0.066705 0.003186 0.351887 0.033027 -0.028795 -0.000344 -0.226540 0.005339 0.060172 0.036147 0.060040 0.136174 -0.092350 -0.007953
polarizability: 2.18353206e+02 -2.11227790e+00 1.61787163e+02 -2.40150535e+00 1.17024236e+01 1.35680279e+02
1716.lowfreq: -10.0511 -7.7706 -0.0003 0.0003 0.0006 10.9352 35.8364 59.6415 85.6592
frequency: 35.7921 59.6125 85.6342 92.4428 102.1203 141.5069 169.8402 188.3813 196.2991 238.4430 248.3008 271.0907 283.9311 297.6983 316.0327 325.5896 363.7341 390.3698 404.0829 430.1291 448.9169 470.5564 486.4642 497.2189 530.0352 544.6041 560.7768 602.7168 631.5654 692.1923 698.1799 719.9818 758.4074 771.7286 784.5008 806.7730 846.8151 851.8443 876.8233 905.5558 930.9428 940.7817 946.4458 987.2355 999.7883 1037.6099 1039.2562 1055.8463 1072.5881 1084.4822 1095.1355 1111.5596 1124.5351 1135.3761 1142.6627 1153.5146 1168.9342 1173.7093 1180.3207 1193.9613 1198.1997 1218.0000 1249.2232 1256.5793 1261.3140 1269.1408 1295.3048 1298.7032 1304.1850 1311.1099 1314.3301 1328.5357 1332.5191 1342.0543 1347.1586 1350.8146 1372.4633 1384.2762 1407.4582 1427.1339 1454.6766 1458.0474 1463.9440 1468.4518 1479.3636 1487.8366 1501.1816 1617.1521 1644.7418 1696.5629 2872.2632 2877.0209 2921.1142 2922.9692 2932.9334 2968.5278 2983.6801 2984.2039 2988.1301 3020.6038 3031.4279 3035.8416 3044.6654 3050.1268 3082.3815 3098.8544 3123.1593 3127.1916 3159.2490 3536.1043 3584.2710
redmass: 3.9664 4.4207 2.6663 3.4140 3.6694 4.0404 2.4002 2.1680 1.6751 1.9410 2.8656 1.7049 2.4977 3.0779 3.3681 2.3624 3.8614 4.1908 2.8015 3.8814 2.7792 3.4665 2.8570 1.2750 4.3788 3.1495 3.1942 3.7674 2.6425 3.8000 3.3175 2.1967 4.8122 2.2852 1.2140 1.5832 2.4127 2.2208 1.6952 1.9108 2.4120 1.4371 2.0521 2.2409 1.9457 2.7019 2.1599 2.2314 1.7691 2.0939 1.9939 1.8175 1.8357 1.5597 1.7227 1.3762 1.5529 1.8449 1.4534 1.7693 2.0052 2.0861 1.6407 1.5037 1.2850 1.2045 1.5835 1.3473 1.5173 1.2970 1.4700 1.4098 1.4849 1.8946 1.4914 1.4924 1.6593 1.2150 1.7001 2.3953 1.0880 1.0917 1.0444 1.1002 1.0761 1.0574 1.1001 7.9725 7.0747 7.3166 1.0800 1.0711 1.0712 1.0808 1.0827 1.0610 1.0611 1.0600 1.0362 1.0902 1.0988 1.0894 1.1029 1.1035 1.0989 1.1000 1.0877 1.0865 1.0993 1.0646 1.0665
irintensity: 0.5464 1.5264 0.7538 1.5183 0.3504 0.9251 1.3094 2.2000 0.3266 33.9189 0.6591 118.8699 9.9337 5.1574 10.2307 2.4408 0.8097 5.6739 1.5742 0.8717 6.0109 4.8651 47.1426 105.3045 9.8498 8.3033 4.5335 12.6687 6.7560 22.2325 5.6949 22.4649 9.4987 17.4100 8.5915 24.4976 14.0350 5.4314 4.2734 4.9328 14.8832 3.7569 7.9749 7.0242 3.2659 68.6271 6.8638 1.4991 14.0403 2.6824 13.6922 1.4397 9.6658 45.0300 125.3492 40.2830 26.9651 36.5820 30.9199 27.9505 82.2267 110.7654 26.8791 26.9111 3.9114 16.9855 2.1796 17.0626 3.6406 7.3342 107.2492 21.2291 2.9332 5.9651 20.0041 0.0455 11.7699 22.4170 7.3226 2.7018 1.7588 10.3238 9.0930 17.2229 1.3039 0.6186 16.8081 19.7179 96.2640 54.3174 40.8514 97.2876 53.5511 28.6443 50.2794 28.3354 24.8128 43.6867 33.3601 34.8175 34.0877 50.1562 28.4928 72.2055 39.8268 39.1470 17.6295 16.6352 19.4238 40.7982 23.4414
temp: 298.150 k
press: 1.00000 atm
elementType: 8 8 7 6 6 6 6 6 6 6 6 6 6 6 6 6 6 6 1 1 1 1 1 1 1 1 1 1 1 1 1 1 1 1 1 1 1 1 1
symmnumber: 1
zpe: 870801.0 jmol-1
zpe.correction: 0.331671 hartree
zpe.thermalcorrener: 0.348795 hartree
zpe.thermalcorrenthalpy: 0.349739 hartree
zpe.thermalcorrgfe: 0.287661 hartree
zpe.sumelectzpe: -787.965570 hartree
zpe.sumelectthermal: -787.948446 hartree
zpe.sumelectthermalent: -787.947502 hartree
zpe.sumelectthermalfe: -788.009580 hartree
dipole: -3.8564 1.0736 1.7315
dipole: 4.3615
quadrupole: -114.1494 -105.0523 -103.4777
quadrupole: 3.3765 9.7009 3.3346
quadrupole: -6.5896 2.5075 4.0821 3.3765 9.7009 3.3346
hfenergy: -788.2972409 hartree
pointgroup: C01 [X(C15H21N1O2)]
dipole: 1.5290391 -0.401317 0.6674412 debye
polarizability: 218.4207918|-0.3643412|162.6488881|2.9144195|-10.471829|134.7509678 unknown
InChI: InChI=1S/C15H21NO2/c1-2-16-7-3-4-11-8-12-10(9-13(11)16)5-6-14(17)15(12)18/h5-6,9-12,17-18H,2-4,7-8H2,1H3
charge 0 multiplicity 1
39 atoms
O  -3.447754 -1.455781 1.393924
O  -4.893213 -0.050837 -0.522286
N  2.927576 0.29739 0.003452
C  0.98839 -1.272315 0.236177
C  -0.530403 -1.353377 -0.021061
C  -1.291355 -0.254337 0.766635
C  1.513287 0.161952 0.062135
C  -0.852294 1.156198 0.269919
C  1.755162 -2.284275 -0.649859
C  3.270008 -2.157159 -0.412328
C  0.655002 1.235696 0.071393
C  3.725576 -0.723031 -0.726393
C  -2.791912 -0.421067 0.659043
C  -1.621267 1.598962 -0.982003
C  3.516418 1.655724 0.001984
C  -3.526598 0.211172 -0.30717
C  -2.896251 1.171786 -1.214946
C  3.515425 2.312705 1.399298
H  1.180712 -1.558237 1.295259
H  -0.738122 -1.222004 -1.100787
H  -0.902038 -2.355908 0.266902
H  -0.985242 -0.332043 1.834556
H  -1.137509 1.884106 1.068352
H  1.525878 -2.088122 -1.717421
H  1.404118 -3.309968 -0.425679
H  3.504459 -2.395575 0.643661
H  3.834923 -2.863712 -1.049793
H  1.043365 2.252387 -0.061162
H  4.78499 -0.594789 -0.436078
H  3.663825 -0.557516 -1.829805
H  -1.131162 2.311965 -1.655357
H  4.560936 1.565032 -0.34826
H  3.002004 2.315005 -0.733077
H  -3.487732 1.517197 -2.06972
H  2.494116 2.371756 1.811149
H  4.13216 1.722672 2.099597
H  3.927916 3.337702 1.345534
H  -3.027787 -1.568021 2.281411
H  -5.18091 -0.748431 0.123304
