program: Gaussian 09
title: 000134372
version: EM64L-G09RevD.01
frameworkgroup: C1[X(C11H12F3N3)]
method: RPBEPBE
basis: SDD
operation: Freq
keyword: #p
keyword: freq=noraman
keyword: PBEPBE/SDD
title: #p freq=noraman PBEPBE/SDD
converged: NO NO NO NO
title: Mulliken charges:
elementType: F F F N N N C C C C C C C C C C C H H H H H H H H H H H H
charge: -0.172299 -0.173152 -0.173269 -0.222478 -0.063246 -0.371503 -0.378273 -0.573282 0.181651 0.440016 -0.497166 -0.378182 0.350423 -0.201396 -0.426247 0.247393 -0.607313 0.239635 0.239776 0.249568 0.250620 0.297074 0.235472 0.313122 0.224030 0.261437 0.208539 0.249195 0.249854
chargesum: 0.00000
title: Mulliken charges with hydrogens summed into heavy atoms:
elementType: F F F N N N C C C C C C C C C C C
charge: -0.172299 -0.173152 -0.173269 -0.222478 -0.063246 -0.058381 0.101137 -0.073094 0.181651 0.440016 -0.200091 -0.142710 0.350423 0.022635 -0.164810 0.247393 0.100275
polarizability: 2.29623713e+02 2.35275924e+01 1.58605856e+02 -8.71951595e-02 -1.66933000e-01 7.56331508e+01
1716.lowfreq: -16.8515 -7.1396 -0.0006 -0.0005 0.0003 3.7090 6.8741 21.7278 46.1098
frequency: -16.1137 17.8972 46.0678 63.0367 69.1748 94.0817 128.2664 144.2213 151.3597 208.0612 225.5066 230.4280 277.7785 304.8088 325.1701 337.3831 371.2714 433.7183 435.5097 464.9216 478.8858 492.6705 529.5468 607.4745 615.1394 650.7567 680.6213 692.6994 737.0012 779.2226 823.7845 833.2745 868.7519 891.4693 903.4615 964.9860 972.7482 979.7835 988.5379 1001.8332 1010.8014 1045.8670 1048.0048 1065.5518 1088.9313 1115.2909 1128.0307 1148.8037 1167.6364 1186.2176 1219.8968 1246.3925 1258.9838 1303.8978 1310.1171 1320.4428 1386.1504 1405.9217 1439.5341 1454.5274 1460.1227 1465.5845 1488.6255 1491.0738 1504.5236 1521.4541 1581.3019 1623.6219 1643.7852 2967.8922 2973.6128 3006.3551 3015.6114 3046.9362 3062.7961 3103.8185 3133.1924 3156.5255 3183.9582 3186.5671 3617.7460
redmass: 11.5495 2.6108 3.5688 1.6057 5.7584 1.6835 4.2803 3.9323 5.0084 4.4534 4.4081 1.4236 8.8822 6.8350 2.7286 7.6395 7.9138 4.6977 5.3790 4.7008 4.5210 3.4395 7.7632 12.0799 5.5655 7.2958 4.4396 2.1202 9.1150 1.5455 7.0259 1.2720 1.4307 1.4706 4.0766 1.3227 5.6516 10.8832 4.8837 5.1207 4.0213 1.6522 3.1567 3.1762 3.4381 1.9076 1.2825 1.1402 1.7121 1.0870 1.1069 2.2195 1.7282 1.5680 1.9954 1.4416 3.2566 4.3846 1.1842 1.0393 2.2682 1.3306 1.3865 1.1172 2.0657 2.3265 6.0891 6.7683 7.3776 1.0577 1.0350 1.0610 1.1069 1.1012 1.1049 1.1003 1.0865 1.0942 1.0932 1.0944 1.0786
irintensity: 0.4356 16.7682 3.7312 4.5654 0.6193 4.3913 0.9055 8.1480 0.1853 1.2506 5.2423 84.5269 0.9233 0.0087 11.4283 6.4248 4.2334 6.4201 0.4960 2.5971 6.2006 0.0331 1.7677 18.7910 1.0798 13.1965 0.6355 26.1507 53.2104 78.7217 13.0201 0.9906 0.2866 40.9464 4.6169 5.1505 20.5478 214.9358 72.7536 106.0328 100.1824 0.1732 6.2403 20.3086 75.4560 4.5386 1.4451 0.4061 7.0508 1.6389 0.1737 158.2360 43.8891 74.0092 68.6873 6.7408 24.6769 39.7149 27.1970 14.3661 70.4257 0.6080 23.7379 10.1476 58.0877 248.6614 11.3457 693.5372 86.0146 43.2275 54.5244 48.8520 17.8247 33.1676 23.5656 24.5316 15.5693 18.3182 0.7501 2.9653 88.4486
temp: 298.150 k
press: 1.00000 atm
elementType: 9 9 9 7 7 7 6 6 6 6 6 6 6 6 6 6 6 1 1 1 1 1 1 1 1 1 1 1 1
symmnumber: 1
zpe: 570663.1 jmol-1
zpe.correction: 0.217354 hartree
zpe.thermalcorrener: 0.233056 hartree
zpe.thermalcorrenthalpy: 0.234000 hartree
zpe.thermalcorrgfe: 0.172419 hartree
zpe.sumelectzpe: -888.877794 hartree
zpe.sumelectthermal: -888.862092 hartree
zpe.sumelectthermalent: -888.861147 hartree
zpe.sumelectthermalfe: -888.922728 hartree
dipole: -9.1171 2.8700 -0.0655
dipole: 9.5584
quadrupole: -77.2818 -88.4529 -103.1550
quadrupole: 9.2667 0.1187 -0.0358
quadrupole: 12.3481 1.1770 -13.5251 9.2667 0.1187 -0.0358
hfenergy: -889.0951476 hartree
pointgroup: C01 [X(C11H12F3N3)]
dipole: -3.562771 -1.2034809 0.0128324 debye
polarizability: 230.5693466|-22.0331708|157.659415|0.3518323|0.1172235|75.6339577 unknown
InChI: InChI=1S/C11H12F3N3/c1-15-10-5-6-17(16-10)9-4-2-3-8(7-9)11(12,13)14/h2-4,7,15H,5-6H2,1H3
charge 0 multiplicity 1
29 atoms
F  4.421538 0.837179 0.03284
F  2.840489 1.994023 -1.111633
F  2.821135 1.994585 1.148777
N  -1.485963 -0.811467 -0.02829
N  -2.054921 0.491714 -0.011065
N  -4.245023 1.404795 0.018776
C  -2.504036 -1.897447 0.001443
C  -3.85127 -1.115064 -0.00102
C  -3.371609 0.340248 0.003969
C  -0.111562 -0.987433 -0.009334
C  0.762391 0.140279 -0.001222
C  0.455844 -2.301311 -0.00176
C  2.155877 -0.063154 0.012706
C  1.85342 -2.469056 0.012433
C  2.726898 -1.359081 0.019575
C  3.039946 1.150636 0.02053
C  -3.762291 2.789312 0.015064
H  -2.382558 -2.520594 0.908976
H  -2.398391 -2.553874 -0.883485
H  -4.46573 -1.341185 0.888912
H  -4.458241 -1.334819 -0.897895
H  0.327123 1.1420 -0.004906
H  -0.192241 -3.183765 -0.007678
H  -5.243736 1.214981 0.02544
H  2.268896 -3.482944 0.018115
H  3.811405 -1.489693 0.030345
H  -4.622999 3.478039 0.032744
H  -3.152959 2.991426 -0.886185
H  -3.122831 2.984572 0.896527
