program: Gaussian 09
title: 000134369
version: EM64L-G09RevD.01
frameworkgroup: C1[X(C16H14O6)]
method: RPBEPBE
basis: SDD
operation: Freq
keyword: #pfreq=noraman
keyword: PBEPBE/SDD
title: #p freq=noraman PBEPBE/SDD
converged: YES YES NO NO
title: Mulliken charges:
elementType: O O O O O O C C C C C C C C C C C C C C C C H H H H H H H H H H H H H H
charge: -0.249902 -0.383085 -0.174875 -0.218554 -0.417903 -0.437781 0.112843 -0.631316 0.057515 -0.014333 0.307060 0.508772 0.266088 -0.544195 -0.598965 0.390828 -0.343042 -0.362363 -0.394725 -0.352710 0.282340 -0.531985 0.256313 0.234414 0.285060 0.363224 0.237813 0.241880 0.230715 0.214720 0.246427 0.360868 0.260108 0.223720 0.224019 0.351008
chargesum: 0.00000
title: Mulliken charges with hydrogens summed into heavy atoms:
elementType: O O O O O O C C C C C C C C C C C C C C C C
charge: -0.249902 -0.019861 -0.174875 -0.218554 -0.057035 -0.086773 0.112843 -0.140589 0.057515 -0.014333 0.307060 0.508772 0.266088 -0.259136 -0.361152 0.390828 -0.101162 -0.131648 -0.180005 -0.106283 0.282340 0.175862
polarizability: 2.98848375e+02 6.61823531e+00 2.14599203e+02 -2.27782888e+01 -5.68986820e+00 1.06664992e+02
1716.lowfreq: -4.0543 0.0005 0.0005 0.0008 3.9191 6.9801 19.6171 26.5494 34.0181
frequency: 18.6302 26.5415 33.9836 65.4116 73.2499 102.9842 122.7332 151.2378 169.9487 186.2007 204.1074 226.8500 247.4846 255.1823 261.6404 295.3507 323.1081 339.6742 345.9863 359.5754 373.8288 378.1815 383.7892 405.9687 411.0974 436.9446 466.8988 497.8540 518.8612 551.6084 584.9682 599.3087 617.6861 628.3600 635.9461 662.2238 675.9188 690.7327 722.3518 743.3535 772.2757 796.0973 802.4313 810.1632 825.0207 843.2777 850.1001 876.3522 914.7158 934.1261 954.1083 960.2255 984.8756 1005.6216 1034.5856 1075.1604 1096.1972 1111.1126 1111.4590 1124.8026 1144.5015 1155.6712 1179.2238 1180.7037 1190.3268 1216.7874 1226.6343 1245.7792 1251.4452 1295.5355 1320.9399 1327.8910 1339.5910 1394.9425 1406.7466 1423.1385 1428.1551 1443.9575 1455.1642 1467.5849 1470.1073 1505.6877 1508.4525 1597.4867 1600.5609 1624.4548 1627.6150 1631.7379 2967.4937 3007.2061 3060.3771 3065.7829 3111.0474 3133.9386 3138.7119 3147.9304 3152.4568 3170.1739 3202.8554 3557.0921 3580.3553 3581.3587
redmass: 5.5038 4.5286 5.7114 5.0046 6.3684 4.4067 5.9703 5.3487 5.3548 2.0683 4.1215 4.3423 3.1227 1.9548 4.4479 4.3955 3.4189 4.4596 1.8781 1.1255 1.1289 5.2426 5.0006 2.9910 2.9105 4.0927 6.5092 3.2701 7.5074 4.5238 6.7431 3.5404 5.8948 5.6792 6.6110 4.3665 4.5037 5.0791 4.0180 3.7226 2.9282 2.8844 2.2401 1.9194 2.5143 1.7100 2.6044 6.0939 6.4470 1.4046 2.0517 1.5411 3.6055 2.8380 2.7740 4.0899 2.4661 1.2828 1.7268 1.9215 1.3725 1.4267 1.3183 1.1479 3.2739 2.1406 1.4561 2.8873 2.1718 1.4524 1.4209 3.4201 1.7835 6.3049 3.8784 3.0778 2.7358 1.6260 1.1061 1.0883 1.0502 2.8036 3.3484 7.9355 6.4630 9.3734 6.5582 9.7458 1.0328 1.0599 1.1044 1.1020 1.0892 1.0896 1.0997 1.0907 1.0951 1.0958 1.0939 1.0661 1.0661 1.0659
irintensity: 0.9515 4.2251 0.4186 0.4608 0.1528 2.2345 2.6149 1.9260 5.2763 0.6651 1.7541 4.6206 5.4111 6.4609 7.2504 8.0375 4.5561 2.5450 72.6051 142.3784 137.1076 2.6585 13.2112 6.7602 1.8795 11.0429 16.6502 7.9172 13.7438 22.4804 10.9373 8.5091 5.5813 18.2650 0.9904 5.8713 7.1416 28.5278 5.0903 63.4817 15.7173 48.5685 31.0164 22.8153 27.4962 59.9816 44.1950 57.8234 7.6328 2.1815 98.4450 35.5457 15.2219 5.9588 57.5307 248.1377 53.6406 12.1169 178.0911 112.5108 232.9691 12.1408 13.1880 20.2712 95.4136 1.5428 29.7049 54.9001 25.1582 27.8570 25.5016 67.1530 10.3676 20.7840 77.6306 91.9313 13.9507 27.7842 12.6243 68.1655 15.5174 126.5683 56.0042 294.0377 13.7201 686.2560 111.4667 69.3023 61.7369 12.4247 40.4935 7.0590 25.2127 14.7379 12.3414 9.2913 10.2964 6.0667 0.6492 19.0601 68.3150 37.9895
temp: 298.150 k
press: 1.00000 atm
elementType: 8 8 8 8 8 8 6 6 6 6 6 6 6 6 6 6 6 6 6 6 6 6 1 1 1 1 1 1 1 1 1 1 1 1 1 1
symmnumber: 1
zpe: 701107.8 jmol-1
zpe.correction: 0.267038 hartree
zpe.thermalcorrener: 0.287139 hartree
zpe.thermalcorrenthalpy: 0.288083 hartree
zpe.thermalcorrgfe: 0.217240 hartree
zpe.sumelectzpe: -1067.836414 hartree
zpe.sumelectthermal: -1067.816313 hartree
zpe.sumelectthermalent: -1067.815369 hartree
zpe.sumelectthermalfe: -1067.886212 hartree
dipole: 5.8492 1.0018 0.2421
dipole: 5.9393
quadrupole: -76.5149 -137.6952 -124.5078
quadrupole: 16.2671 -9.4748 -4.3984
quadrupole: 36.3911 -24.7892 -11.6018 16.2671 -9.4748 -4.3984
hfenergy: -1068.1034518 hartree
pointgroup: C01 [X(C16H14O6)]
dipole: -2.3030739 -0.3883617 0.0726604 debye
polarizability: 298.4313164|6.3026116|214.5445889|24.6269462|5.8875597|107.1366641 unknown
InChI: InChI=1S/C16H14O6/c1-21-12-6-11(18)7-13-14(12)15(19)16(20,22-13)8-9-2-4-10(17)5-3-9/h2-7,17-18,20H,8H2,1H3
charge 0 multiplicity 1
36 atoms
O  -0.005964 -0.584153 0.606969
O  0.880508 1.425045 1.599012
O  -1.31971 2.765488 -0.043686
O  -4.136094 1.517721 -0.426954
O  -3.936165 -3.370501 0.199921
O  6.455749 -1.22246 0.097178
C  0.268025 0.910015 0.421708
C  1.244423 1.096019 -0.755126
C  -1.152798 1.526969 0.122508
C  -2.084069 0.40496 0.083041
C  -1.363122 -0.792728 0.369196
C  2.623088 0.503506 -0.520773
C  -3.485742 0.323271 -0.162856
C  -1.957195 -2.059703 0.410883
C  -4.118995 -0.94179 -0.128935
C  -3.345615 -2.104086 0.15627
C  3.637149 1.254017 0.122628
C  2.927724 -0.817355 -0.939597
C  4.919653 0.707995 0.343512
C  4.202267 -1.379276 -0.728214
C  5.199186 -0.612005 -0.08446
C  -5.580429 1.47882 -0.691136
H  1.300297 2.187503 -0.923988
H  0.774296 0.648212 -1.649428
H  -1.395139 -2.96822 0.630638
H  0.221003 1.487155 2.336037
H  -5.192575 -1.041234 -0.321014
H  3.417029 2.270004 0.467036
H  2.153233 -1.418302 -1.42991
H  5.693051 1.305381 0.844622
H  4.440835 -2.397236 -1.050056
H  -4.907109 -3.324833 0.014428
H  -5.860772 2.526176 -0.869358
H  -6.133923 1.084327 0.182343
H  -5.804488 0.871485 -1.588823
H  7.07629 -0.608889 0.563185
