program: Gaussian 09
title: 000134367
version: EM64L-G09RevD.01
frameworkgroup: C1[X(C18H16O4)]
method: RPBEPBE
basis: SDD
operation: Freq
keyword: #pfreq=noraman
keyword: PBEPBE/SDD
title: #p freq=noraman PBEPBE/SDD
converged: YES YES NO NO
title: Mulliken charges:
elementType: O O O O C C C C C C C C C C C C C C C C C C H H H H H H H H H H H H H H H H
charge: -0.281723 -0.383732 -0.493518 -0.216557 0.500256 0.272648 0.331667 -0.622442 -0.429715 -0.358277 0.647414 -0.553170 -0.379639 -0.358920 -0.038022 0.231709 -0.592074 -0.325804 -0.026861 -0.230165 -0.586796 -0.131050 0.216291 0.225379 0.235505 0.247962 0.271920 0.259411 0.263968 0.231497 0.222919 0.234202 0.392542 0.253634 0.379688 0.218628 0.218552 0.152674
chargesum: 0.00000
title: Mulliken charges with hydrogens summed into heavy atoms:
elementType: O O O O C C C C C C C C C C C C C C C C C C
charge: -0.281723 0.008810 -0.113830 -0.216557 0.500256 0.272648 0.331667 -0.180772 -0.194210 -0.110315 0.647414 -0.281250 -0.120228 -0.094952 -0.038022 0.231709 -0.360577 -0.102885 0.207341 0.023468 -0.149616 0.021623
polarizability: 2.89685612e+02 3.26620607e+01 2.99431771e+02 1.05781409e+01 -7.05839313e+00 1.36945827e+02
1716.lowfreq: -3.8386 -3.2343 -0.0005 0.0002 0.0005 4.2587 15.2304 22.3113 29.3471
frequency: 15.1205 22.2920 29.3448 46.2988 59.6820 71.0832 81.8651 119.5954 122.3862 133.4458 172.5307 196.1417 203.9351 238.8463 256.1553 259.0174 277.1498 289.8420 296.8343 304.5125 367.3270 382.6983 391.9508 397.6837 413.0162 452.4885 489.3579 510.2336 523.8944 536.3737 554.0917 570.6159 614.3037 619.5062 628.5249 656.3350 663.3288 711.4628 736.2455 770.4138 796.3817 814.6730 815.1042 835.8814 843.5038 869.9971 886.9582 907.6537 935.0460 949.0068 956.7259 963.0926 973.7056 980.7609 997.3542 1000.6866 1008.0346 1016.1912 1102.7729 1105.8860 1116.5487 1140.3379 1154.9548 1168.5456 1193.0080 1201.8796 1213.0712 1220.1701 1229.6959 1256.9319 1279.3412 1286.3729 1292.4914 1303.9101 1309.4900 1344.5929 1377.7923 1379.7406 1409.9681 1421.8603 1425.2687 1443.3114 1454.5945 1491.6326 1520.1280 1587.2830 1591.0509 1599.6598 1608.8207 1619.3266 1633.7763 1655.5308 2846.4386 2967.1508 3017.5216 3070.0893 3083.8725 3097.4697 3125.3618 3128.5351 3133.7280 3138.7706 3158.4620 3169.7032 3170.6949 3196.4543 3502.7610 3630.7050
redmass: 6.3261 3.5629 4.7410 4.8647 4.9134 4.3489 3.5205 2.2821 4.4913 4.2144 5.9406 5.6780 3.6484 4.1185 4.9382 1.1428 5.8480 5.0577 4.0199 6.3893 4.8362 3.0665 2.8423 3.6298 2.9478 4.5489 3.9665 1.1114 2.7064 4.7260 5.1787 4.6540 3.0618 2.8649 6.6791 2.8064 5.8434 3.6450 3.5846 3.9499 5.5194 2.8615 1.5354 1.2621 2.0010 1.4717 1.8035 1.4435 2.1034 1.3923 1.3572 1.6479 1.3523 5.1152 3.8085 1.2495 2.7556 1.1531 1.7589 1.4711 1.5637 3.1266 1.6079 1.6285 1.5031 2.0461 1.4642 2.2118 1.5326 1.9977 1.3986 1.6094 1.2580 1.4583 1.4059 3.4837 4.8914 1.4628 2.9059 3.2574 1.2217 6.2056 1.1066 2.5080 3.6843 7.1635 6.8867 6.1315 6.9590 6.6085 5.3149 4.6833 1.0841 1.0591 1.0999 1.0884 1.0624 1.0916 1.0918 1.0897 1.0884 1.0918 1.0958 1.0953 1.0911 1.1143 1.0647 1.0668
irintensity: 2.0134 0.4655 2.6552 1.5079 2.3708 1.2931 1.2328 3.9053 1.8892 0.3930 6.5155 2.3998 2.7483 2.2430 4.2358 154.2918 3.9767 13.9690 17.1049 4.3366 4.5802 2.2059 2.8400 2.6622 0.5779 3.8694 11.4852 127.5398 5.0593 14.8341 5.7728 30.9666 7.4785 8.8741 3.7202 12.7211 19.2110 2.9886 3.5257 0.3504 8.0127 28.9296 30.2411 1.9829 47.9535 3.7399 7.1324 19.4785 10.3229 79.9793 0.9529 10.5013 0.0698 247.6453 62.3055 56.3269 35.8363 23.6458 59.9193 22.5781 4.3436 276.7319 17.5269 170.7640 76.0793 27.9476 69.4575 194.6597 45.6975 131.6562 17.3495 241.6678 5.1977 79.9220 26.8521 31.7144 1.6008 65.8751 2.0773 32.6564 6.8285 85.5463 27.3824 176.0705 163.7766 99.9458 274.4730 141.8640 71.3739 18.7151 201.7413 19.3897 155.8451 31.4276 13.9294 19.5799 15.9085 6.9900 9.4397 16.4578 9.7257 9.6771 7.1083 3.8614 1.4921 23.7215 174.2020 79.0733
temp: 298.150 k
press: 1.00000 atm
elementType: 8 8 8 8 6 6 6 6 6 6 6 6 6 6 6 6 6 6 6 6 6 6 1 1 1 1 1 1 1 1 1 1 1 1 1 1 1 1
symmnumber: 1
zpe: 761507.7 jmol-1
zpe.correction: 0.290043 hartree
zpe.thermalcorrener: 0.311127 hartree
zpe.thermalcorrenthalpy: 0.312071 hartree
zpe.thermalcorrgfe: 0.237259 hartree
zpe.sumelectzpe: -994.782830 hartree
zpe.sumelectthermal: -994.761746 hartree
zpe.sumelectthermalent: -994.760802 hartree
zpe.sumelectthermalfe: -994.835614 hartree
dipole: -3.6316 -2.9430 -1.6015
dipole: 4.9411
quadrupole: -84.4384 -164.1305 -126.0344
quadrupole: -3.3861 7.8388 -5.6598
quadrupole: 40.4294 -39.2627 -1.1667 -3.3861 7.8388 -5.6598
hfenergy: -995.0728735 hartree
pointgroup: C01 [X(C18H16O4)]
dipole: 1.3284182 1.3083249 -0.5501293 debye
polarizability: 284.2599785|31.6387037|304.0637283|-7.8082935|14.7265736|137.7395025 unknown
InChI: InChI=1S/C18H16O4/c1-2-4-13-6-8-15(9-7-13)22-17-12-14(5-3-10-19)11-16(20)18(17)21/h2-3,5-12,20-21H,1,4H2
charge 0 multiplicity 1
38 atoms
O  0.221639 2.06001 0.56385
O  2.433859 3.532364 -0.077946
O  4.794687 2.405737 -0.652984
O  1.366092 -5.462619 0.231421
C  -3.726654 0.532626 0.138861
C  1.379321 1.351271 0.206466
C  -1.066468 1.472948 0.404951
C  -5.172009 0.05591 -0.01874
C  -3.310701 1.218559 1.30779
C  -2.777368 0.333443 -0.897176
C  2.710891 -0.698299 -0.105172
C  1.478845 -0.053403 0.201213
C  -1.98737 1.690347 1.44884
C  -1.452469 0.802716 -0.777608
C  2.519565 2.148197 -0.085205
C  3.746419 1.498176 -0.381595
C  3.854887 0.101357 -0.398008
C  2.851917 -2.153769 -0.125585
C  -5.299291 -1.342113 -0.597091
C  1.880095 -3.100476 0.101721
C  -6.009679 -1.661358 -1.70799
C  2.199222 -4.529514 0.039144
H  -5.664667 0.085892 0.974201
H  -5.730255 0.76215 -0.665847
H  -4.027498 1.384875 2.120854
H  -3.082584 -0.191753 -1.809563
H  0.594299 -0.646472 0.447404
H  -1.65992 2.223711 2.34597
H  -0.7360 0.660273 -1.592991
H  4.811076 -0.382503 -0.633962
H  3.863753 -2.527209 -0.353408
H  -4.767386 -2.135101 -0.049563
H  3.329948 3.904495 -0.300016
H  0.840225 -2.84032 0.333105
H  5.643878 1.948737 -0.859766
H  -6.077524 -2.693478 -2.069307
H  -6.547525 -0.898212 -2.285122
H  3.27105 -4.760995 -0.200348
