program: Gaussian 09
title: 000134311
version: EM64L-G09RevD.01
frameworkgroup: C1[X(C14H16N2O3)]
method: RPBEPBE
basis: SDD
operation: Freq
keyword: #p
keyword: freq=noraman
keyword: PBEPBE/SDD
title: #p freq=noraman PBEPBE/SDD
converged: YES YES NO NO
title: Mulliken charges:
elementType: O O O N N C C C C C C C C C C C C C C H H H H H H H H H H H H H H H H
charge: -0.238282 -0.217353 -0.249807 -0.354020 -0.402342 0.147209 -0.549506 -0.401643 0.464906 -0.490985 0.109922 0.146430 -0.728109 -0.379695 -0.413431 -0.460887 -0.387977 0.476301 -0.070331 0.250381 0.224938 0.240275 0.211896 0.252551 0.268926 0.347205 0.214693 0.225362 0.242359 0.276483 0.237273 0.221827 0.306568 0.306102 0.172762
chargesum: 0.00000
title: Mulliken charges with hydrogens summed into heavy atoms:
elementType: O O O N N C C C C C C C C C C C C C C
charge: -0.238282 -0.217353 -0.249807 -0.006815 -0.096241 0.147209 -0.074188 0.050528 0.464906 0.030492 0.109922 0.146430 -0.045695 -0.103211 -0.176158 -0.239060 -0.081410 0.476301 0.102431
polarizability: 2.31822914e+02 7.11719684e+00 1.46808813e+02 -2.82294132e-01 -1.67735507e+01 1.50751494e+02
1716.lowfreq: -12.1231 -1.6976 -0.0002 0.0006 0.0007 4.0159 28.6475 33.4931 71.0128
frequency: 28.4063 33.4765 70.9695 83.8059 93.7027 120.1201 146.2779 152.0153 152.9789 182.0782 208.7514 256.6309 272.1292 297.1967 307.6565 336.5348 363.8976 379.0755 397.1261 412.7582 438.6312 464.6709 501.0059 543.9568 559.8246 561.3940 613.3435 634.7181 652.4288 684.2149 687.5935 736.5666 740.9797 764.7385 788.9790 812.0370 838.4938 840.4115 856.8657 867.5984 898.9756 947.0448 955.1376 967.3650 974.5649 991.6596 1005.3963 1030.9558 1057.0313 1080.9812 1101.5260 1109.6019 1134.1200 1147.1695 1175.7533 1193.3941 1207.5298 1218.2274 1263.2877 1266.2607 1295.1819 1309.8340 1317.5692 1323.5819 1336.0298 1345.9071 1358.2904 1375.4151 1387.8367 1392.1148 1412.5272 1443.3873 1456.0605 1481.3129 1485.1590 1486.2613 1494.1848 1512.0163 1590.5445 1614.1540 1622.3289 1638.9645 1644.6970 2933.3450 2985.2161 2995.4401 3001.2692 3014.4618 3054.4377 3064.9619 3077.7535 3079.8914 3088.8219 3113.7688 3144.1119 3149.9909 3190.2753 3476.8385 3514.0538
redmass: 5.4117 8.3942 4.4875 3.8073 2.8359 3.7319 7.8686 3.6415 6.5689 2.9736 1.7319 3.6587 2.4646 2.4593 3.5166 3.5732 6.8263 3.4410 4.2438 3.2417 3.3362 4.5019 4.2390 3.6090 2.8303 3.2734 5.2756 6.9047 1.1668 3.3344 4.2032 2.1849 3.6221 2.3288 2.0911 1.4403 1.9106 2.9895 1.4369 2.8700 2.4830 1.6000 1.8756 1.8422 1.5126 1.3506 3.2893 2.0575 2.0308 2.7380 3.3510 2.4511 1.5639 1.8437 1.8035 1.9562 1.2204 2.1625 1.9432 1.6833 2.7298 1.5780 1.5166 1.6276 1.3297 1.5422 2.6880 1.8141 1.4740 1.2070 3.4892 1.0833 1.0819 1.0741 1.0509 1.8750 1.1353 2.4487 4.9973 7.2020 6.0285 5.0793 6.7465 1.0865 1.0359 1.0625 1.0652 1.0606 1.0994 1.1003 1.0979 1.0972 1.1012 1.0894 1.0891 1.0946 1.0950 1.0758 1.0770
irintensity: 5.4484 0.3270 0.3900 7.8226 2.3729 6.7076 9.5912 3.8224 3.4880 2.5099 1.8730 9.7430 2.6243 6.1550 7.1476 4.9032 9.6724 2.0650 4.6749 1.1965 17.7490 4.0267 0.7616 6.4693 20.1807 19.6876 9.3653 0.4610 68.4027 7.5219 12.6155 2.0981 0.6265 9.4821 6.1174 112.9481 28.3879 19.3572 36.0169 0.8618 7.4101 1.5229 3.9855 5.1775 3.7946 5.5416 4.3140 3.8906 7.4694 1.4392 46.9545 3.7153 18.8960 0.5414 0.8659 215.4249 23.8437 6.3326 12.8842 98.5958 69.7931 25.8792 45.9225 15.4614 3.9543 17.7311 28.5397 5.8902 67.4989 12.4058 33.8298 11.9116 14.1588 16.9302 19.2398 46.0401 58.8676 278.8599 24.3708 147.8085 106.7595 196.1608 359.5747 135.0953 33.0778 19.4614 7.1650 26.8890 1.3240 21.7614 23.2695 28.0991 32.9331 18.5507 13.6455 1.3242 4.4289 37.1520 13.9342
temp: 298.150 k
press: 1.00000 atm
elementType: 8 8 8 7 7 6 6 6 6 6 6 6 6 6 6 6 6 6 6 1 1 1 1 1 1 1 1 1 1 1 1 1 1 1 1
symmnumber: 1
zpe: 734614.9 jmol-1
zpe.correction: 0.279800 hartree
zpe.thermalcorrener: 0.297281 hartree
zpe.thermalcorrenthalpy: 0.298225 hartree
zpe.thermalcorrgfe: 0.233791 hartree
zpe.sumelectzpe: -876.915087 hartree
zpe.sumelectthermal: -876.897606 hartree
zpe.sumelectthermalent: -876.896662 hartree
zpe.sumelectthermalfe: -876.961096 hartree
dipole: 1.3232 -2.6628 0.6460
dipole: 3.0428
quadrupole: -115.5569 -127.0997 -106.4416
quadrupole: -0.5209 26.4549 0.0021
quadrupole: 0.8092 -10.7336 9.9245 -0.5209 26.4549 0.0021
hfenergy: -877.1948868 hartree
pointgroup: C01 [X(C14H16N2O3)]
dipole: -0.5414761 -0.8277971 -0.6743072 debye
polarizability: 231.1185043|-11.1118795|135.7733514|-0.8408207|9.563076|162.4913653 unknown
InChI: InChI=1S/C14H16N2O3/c1-2-14(8-7-12(18)16-13(14)19)10-3-5-11(6-4-10)15-9-17/h3-6,9,15-16H,2,7-8H2,1H3
charge 0 multiplicity 1
35 atoms
O  2.528166 -0.475011 -2.003474
O  3.263032 3.00766 0.936043
O  -5.218932 0.524128 1.294137
N  2.846758 1.203932 -0.456947
N  -4.18417 0.478118 -0.832294
C  1.425989 -0.771974 0.202136
C  1.931679 -0.38289 1.619918
C  1.530435 -2.318417 -0.038631
C  -0.056745 -0.367265 -0.0429
C  1.938873 1.14163 1.850785
C  2.300319 -0.039149 -0.841484
C  2.730299 1.878407 0.782222
C  2.928681 -2.941231 0.163226
C  -0.548789 -0.197629 -1.364599
C  -0.987619 -0.26281 1.021392
C  -1.905904 0.081834 -1.604421
C  -2.352733 0.013651 0.801114
C  -2.822296 0.192236 -0.525915
C  -5.258717 0.62338 0.038449
H  2.959926 -0.768177 1.745273
H  1.320515 -0.883286 2.391535
H  1.196636 -2.514194 -1.073384
H  0.797136 -2.804544 0.634235
H  2.377756 1.407981 2.827261
H  0.908544 1.547181 1.84136
H  3.393275 1.689192 -1.180412
H  3.275847 -2.8762 1.210033
H  2.899514 -4.012985 -0.104328
H  3.679446 -2.459575 -0.488248
H  0.13366 -0.290006 -2.216153
H  -0.661646 -0.405621 2.056935
H  -2.255692 0.211993 -2.636857
H  -3.053764 0.091009 1.634247
H  -4.40109 0.592152 -1.826506
H  -6.198587 0.84658 -0.517149
