program: Gaussian 09
title: 000011112
version: EM64L-G09RevD.01
frameworkgroup: C1[X(C6H7N3O)]
method: RPBEPBE
basis: SDD
operation: Freq
keyword: #pfreq=noraman
keyword: PBEPBE/SDD
title: #p freq=noraman PBEPBE/SDD
converged: YES YES NO NO
title: Mulliken charges:
elementType: O N N N C C C C C C H H H H H H H
charge: -0.271324 -0.394779 -0.001787 -0.499222 0.259098 -0.260209 0.149401 -0.444925 -0.176246 -0.323153 0.283714 0.244439 0.238151 0.249057 0.332188 0.309054 0.306543
chargesum: 0.00000
title: Mulliken charges with hydrogens summed into heavy atoms:
elementType: O N N N C C C C C C
charge: -0.271324 -0.062591 -0.001787 0.116375 0.259098 0.023505 0.149401 -0.200486 0.061905 -0.074095
polarizability: 1.25557659e+02 1.10705124e+00 8.82055069e+01 -2.48565747e+00 -2.08132361e+00 4.15425200e+01
1716.lowfreq: -13.0323 -7.8178 -0.0005 -0.0005 0.0007 0.1369 47.6597 106.3413 116.8973
frequency: 47.6338 106.3387 116.8899 143.6768 228.3986 285.2415 347.7601 377.9648 412.6016 484.8953 557.1449 609.6506 694.9039 709.9174 723.5831 774.6893 836.2900 861.4274 921.5346 960.5345 1000.8680 1004.7745 1020.9470 1068.5648 1107.2771 1189.7150 1208.6253 1285.0950 1289.6817 1312.2152 1335.2174 1406.3259 1435.3315 1472.1190 1544.9621 1583.7444 1599.5848 1678.8198 3116.0514 3137.8636 3155.6947 3174.5422 3391.6762 3507.6251 3557.5883
redmass: 4.9229 3.3994 1.3181 3.5188 3.4949 4.8115 5.7883 3.0460 4.9674 5.9001 1.1743 7.6864 6.9614 5.1318 1.8102 1.6376 1.8006 8.3972 1.4129 1.4600 3.3980 1.4619 4.3385 2.8094 1.6083 1.9186 1.8997 1.2561 2.0284 10.5844 1.3151 1.9891 1.6824 2.0686 5.6931 5.9013 8.0718 1.0612 1.0907 1.0890 1.0917 1.1001 1.0428 1.0987 1.0794
irintensity: 5.2639 8.9556 18.1630 5.9917 4.6346 34.9664 1.5757 1.6231 6.9223 1.6871 163.8439 4.9613 0.8924 2.5261 48.6234 132.0892 26.3590 23.1887 2.6579 1.2201 10.6553 1.8945 0.0472 3.9092 13.5792 0.3098 5.0830 15.6079 67.6581 1.5838 1.0579 17.9732 133.6273 68.9238 3.8545 26.1882 159.0652 30.8150 23.3568 6.7004 7.7557 17.1153 0.9840 2.6495 31.9169
temp: 298.150 k
press: 1.00000 atm
elementType: 8 7 7 7 6 6 6 6 6 6 1 1 1 1 1 1 1
symmnumber: 1
zpe: 339655.6 jmol-1
zpe.correction: 0.129368 hartree
zpe.thermalcorrener: 0.138550 hartree
zpe.thermalcorrenthalpy: 0.139494 hartree
zpe.thermalcorrgfe: 0.094383 hartree
zpe.sumelectzpe: -471.560746 hartree
zpe.sumelectthermal: -471.551564 hartree
zpe.sumelectthermalent: -471.550620 hartree
zpe.sumelectthermalfe: -471.595731 hartree
dipole: 0.3279 0.1830 -0.8250
dipole: 0.9065
quadrupole: -52.3869 -62.6886 -58.9645
quadrupole: 8.2334 -1.6278 -2.1700
quadrupole: 5.6264 -4.6753 -0.9512 8.2334 -1.6278 -2.1700
hfenergy: -471.6901143 hartree
pointgroup: C01 [X(C6H7N3O1)]
dipole: 0.1339334 0.0708848 -0.3228454 debye
dipolederiv: -0.751741 0.2511893 0.0415148 0.0285901 -0.8557936 -0.1320717 -0.0345035 -0.103596 -0.3900625 -0.3019984 -0.2393505 -0.0864226 -0.5071675 -0.6104506 0.0072494 -0.1623039 0.0308892 -0.4304453 -0.4880389 -0.0304637 0.0171447 -0.0447961 -0.324228 0.0162048 0.0171531 0.0245566 -0.2487109 -0.2039622 -0.105795 -0.0337028 -0.2077497 -0.3708087 -0.1232767 -0.0583869 -0.1096097 -0.0835585 -0.3997318 0.0329923 0.0033913 -0.063296 -0.2063932 0.0094094 0.0219606 0.0324224 0.0312438 0.0899053 -0.07225 0.0094772 0.0663358 0.1022974 -0.0355831 0.0101278 -0.0135069 -0.08259 1.2864017 0.0564591 0.0510315 0.3192167 1.2208208 0.2676869 0.1153556 0.2109779 0.2715683 0.1938503 0.0081252 -0.0223334 0.0503399 0.2235623 -0.0675029 -0.0726187 -0.0711864 -0.0511254 -0.1812628 0.1473781 -0.0228621 0.2513974 -0.020149 -0.0104268 -0.0146818 -0.0195601 -0.1035018 0.3697264 0.0251542 -0.0180202 -0.1070669 0.1518143 -0.0377643 0.0038597 -0.0423192 -0.0572116 0.118423 0.0696189 -0.0119933 0.0337533 0.0301072 0.023842 -0.0242036 0.0102139 0.1450704 -0.0010097 -0.1029623 0.0204372 -0.1189134 -0.0106507 0.0289745 0.0432212 0.0127932 0.1204886 0.0127336 -0.084725 0.0134491 -0.1072411 -0.0241615 0.0313807 0.0173904 0.0286436 0.1554528 -0.1178383 -0.0106474 0.0076711 0.0109634 0.09447 0.0068988 -0.0087374 0.0132534 0.1368839 0.0936388 0.0517326 0.0169575 0.0952632 0.1987217 -0.0478185 0.0342039 -0.0580682 0.325777 0.1502399 -0.0131965 0.0314311 0.1361699 0.1237608 0.1531201 0.0942937 0.0900187 0.2103808 0.1306641 0.0167408 -0.0171712 0.164201 0.2770808 -0.0903228 0.0178698 -0.0359226 0.0503402 unknown
polarizability: 125.2997285|3.7029817|88.3562575|0.1758848|-3.5465676|41.6496995 unknown
InChI: InChI=1S/C6H7N3O/c7-9-6(10)5-2-1-3-8-4-5/h1-4,9H,7H2
charge 0 multiplicity 1
17 atoms
O  -1.95394 1.298224 0.194499
N  -2.135517 -0.965388 -0.295278
N  2.124135 -1.36051 0.19553
N  -3.556424 -0.959643 -0.326038
C  0.103967 0.016369 -0.025047
C  0.901927 1.17417 -0.207217
C  -1.392662 0.179789 -0.024527
C  0.766686 -1.220906 0.191714
C  2.305183 1.047817 -0.202825
C  2.871099 -0.235312 -0.011256
H  0.403284 2.139787 -0.338849
H  0.20721 -2.140632 0.404758
H  2.952717 1.918581 -0.343241
H  3.957393 -0.378783 -0.013322
H  -1.698627 -1.833516 -0.606232
H  -3.893801 -0.224613 -0.96496
H  -3.93193 -0.805736 0.620693
