program: Gaussian 09
title: 000134278
version: EM64L-G09RevD.01
frameworkgroup: C1[X(C16H11N3O6)]
method: RPBEPBE
basis: SDD
operation: Freq
keyword: #p
keyword: freq=noraman
keyword: PBEPBE/SDD
title: #p freq=noraman PBEPBE/SDD
converged: NO YES NO NO
title: Mulliken charges:
elementType: O O O O O O N N N C C C C C C C C C C C C C C C C H H H H H H H H H H H
charge: -0.214207 -0.227537 -0.382759 -0.282183 -0.213234 -0.197247 -0.117452 -0.066442 0.049340 -0.050745 0.218194 0.079392 0.115551 -0.309087 -0.294945 0.255256 -0.343100 -0.597413 -0.293760 0.111083 -0.323774 0.402887 -0.361076 0.268955 -0.305400 0.290781 0.294787 0.249040 0.258256 0.225548 0.258493 0.273153 0.280714 0.271645 0.295865 0.381423
chargesum: 0.00000
title: Mulliken charges with hydrogens summed into heavy atoms:
elementType: O O O O O O N N N C C C C C C C C C C C C C C C C
charge: -0.214207 -0.227537 -0.001336 -0.282183 -0.213234 -0.197247 -0.117452 -0.066442 0.049340 -0.050745 0.218194 0.079392 0.115551 -0.018307 -0.000158 0.255256 -0.094060 0.144884 -0.020607 0.111083 -0.043060 0.402887 -0.089432 0.268955 -0.009535
polarizability: 5.96379084e+02 2.79962023e+01 2.42474209e+02 -1.55773433e-02 5.54581749e-02 8.48632579e+01
1716.lowfreq: -6.0214 -1.7444 -0.0006 -0.0005 -0.0005 2.4261 19.5940 25.4095 33.0632
frequency: 19.5912 25.3814 33.0624 34.2560 50.8369 63.8640 87.3905 104.9876 134.2039 147.7255 154.5483 158.2605 182.7587 198.3837 214.9834 232.6263 297.8030 310.5885 322.6271 328.2084 362.1041 363.1420 382.2815 407.9075 426.0560 457.7747 467.5111 504.7669 507.4548 536.4643 557.8653 562.8774 602.3061 632.8387 640.1314 661.3361 672.8476 679.6100 699.6075 704.5498 728.5699 753.7666 762.1887 801.8847 805.9075 815.3180 861.3585 871.2584 902.4883 908.1797 912.5738 923.7160 961.2684 964.0048 983.1943 1011.4396 1018.5927 1026.6261 1048.2218 1096.9944 1123.3861 1124.4673 1130.8292 1153.4048 1172.8173 1202.3607 1219.6610 1239.0042 1254.8865 1279.2411 1287.3155 1302.0284 1328.7887 1345.9107 1352.5834 1356.8188 1373.2392 1380.3131 1416.6754 1440.4942 1447.2532 1455.5888 1484.5392 1496.6921 1520.3960 1548.9641 1558.4047 1579.2971 1591.8591 1625.2478 1639.6507 3013.5230 3108.6708 3129.7282 3137.0465 3148.4409 3153.0092 3158.1021 3170.6290 3229.5911 3260.0125 3496.9846
redmass: 8.8674 6.4933 8.2177 9.4289 9.1234 10.3021 9.7240 6.1692 1.4964 2.1192 7.6787 4.5505 4.1683 10.1258 4.5578 5.1289 3.9535 9.5415 4.0730 3.6396 6.3761 9.0638 7.2986 8.1780 3.6332 7.5565 7.5063 3.6117 7.2174 4.9952 5.4367 5.4219 1.4444 4.6149 3.9360 6.6528 5.0156 7.5178 4.0355 6.9681 10.1294 6.4015 6.9671 5.1286 1.7134 2.6967 1.6284 7.8106 1.4470 8.9451 1.8540 6.3500 5.7050 1.3905 1.1046 1.3550 2.7446 1.2640 4.0775 1.9249 1.6520 1.3159 4.0055 1.8310 1.8136 1.9312 2.7518 2.4443 2.5915 2.1709 5.0160 2.0711 2.4617 9.2727 3.6330 7.2053 3.4434 3.7458 3.4970 1.6536 1.9288 1.0425 6.5700 1.3526 6.5607 7.1238 6.3327 7.1598 8.1004 7.5495 6.2276 1.0329 1.1021 1.1033 1.0945 1.0877 1.0888 1.0932 1.0978 1.0963 1.1030 1.0636
irintensity: 1.0169 2.3775 1.7226 2.9644 0.0249 0.4523 0.9535 6.2774 1.6157 4.0365 0.5273 0.8061 0.2003 3.1114 0.8690 9.5258 0.1232 0.4612 0.6170 0.0005 4.0645 8.1343 7.5902 1.1006 1.1911 0.7408 12.9971 4.2518 18.1892 4.7846 21.7939 1.0962 94.7338 93.5664 11.1138 28.6005 17.7908 27.7334 4.8685 0.5237 23.4402 22.7717 1.5618 1.5352 4.0776 78.7960 20.9489 26.9042 0.9863 14.2355 6.3491 0.2999 3.6346 11.2852 67.5579 0.0822 110.0067 34.0190 269.4343 142.0867 39.8083 1.1710 76.8804 14.8225 0.2651 228.2551 455.3433 13.3448 12.6061 54.9582 115.2114 7.7003 18.0706 73.3585 123.7359 54.6445 19.3800 36.4226 365.5487 66.9721 12.6206 16.5749 510.2784 17.7360 64.6726 33.8851 86.5260 458.8577 97.0506 360.2214 29.2670 26.3643 11.7838 14.2569 2.4325 2.9153 1.7047 1.7283 5.1631 0.9789 5.5653 43.1041
temp: 298.150 k
press: 1.00000 atm
elementType: 8 8 8 8 8 8 7 7 7 6 6 6 6 6 6 6 6 6 6 6 6 6 6 6 6 1 1 1 1 1 1 1 1 1 1 1
symmnumber: 1
zpe: 655116.5 jmol-1
zpe.correction: 0.249521 hartree
zpe.thermalcorrener: 0.270994 hartree
zpe.thermalcorrenthalpy: 0.271939 hartree
zpe.thermalcorrgfe: 0.195923 hartree
zpe.sumelectzpe: -1230.054142 hartree
zpe.sumelectthermal: -1230.032668 hartree
zpe.sumelectthermalent: -1230.031724 hartree
zpe.sumelectthermalfe: -1230.107740 hartree
dipole: -0.5163 6.6605 -0.0007
dipole: 6.6805
quadrupole: -208.1631 -135.2999 -143.3196
quadrupole: 15.0610 0.1016 -0.0232
quadrupole: -45.9023 26.9610 18.9413 15.0610 0.1016 -0.0232
hfenergy: -1230.3036627 hartree
pointgroup: C01 [X(C16H11N3O6)]
dipole: -0.1975109 -2.6207636 -0.0232897 debye
polarizability: 596.4825605|-27.2623617|242.3461349|2.4896909|1.264026|84.887855 unknown
InChI: InChI=1S/C16H11N3O6/c1-18-8-12(16(21)22)14(20)11-6-3-9(17-15(11)18)2-4-10-5-7-13(25-10)19(23)24/h2-8,21H,1H3
charge 0 multiplicity 1
36 atoms
O  -4.634851 2.295394 -0.030168
O  4.519785 0.257461 0.002938
O  -7.021975 0.847834 -0.048763
O  -6.871959 -1.461031 -0.075753
O  8.103283 0.24058 0.022456
O  6.608767 1.993425 0.031132
N  -2.736603 -1.451477 -0.049271
N  -0.606038 -0.440034 -0.030071
N  6.900279 0.733642 0.019876
C  -1.952546 -0.275564 -0.035745
C  -2.614259 0.992561 -0.029519
C  -4.107034 1.138912 -0.036472
C  -4.821405 -0.15443 -0.050534
C  -4.10468 -1.35176 -0.056404
C  -1.784317 2.140251 -0.016354
C  0.180085 0.685531 -0.017394
C  -0.388994 1.995867 -0.010161
C  -2.063348 -2.770356 -0.05596
C  1.63466 0.520837 -0.010784
C  -6.296251 -0.335788 -0.060032
C  2.262129 -0.701362 -0.018317
C  3.685996 -0.88938 -0.012363
C  4.495206 -2.039653 -0.019642
C  5.831028 -0.222911 0.0052
C  5.860758 -1.615336 -0.007707
H  -4.667482 -2.290561 -0.067689
H  -2.273711 3.119451 -0.011379
H  0.268718 2.870185 -0.000204
H  -1.426183 -2.867534 -0.949633
H  -2.832885 -3.557389 -0.058076
H  -1.423897 -2.874545 0.835135
H  2.236576 1.43748 0.000675
H  1.647712 -1.608643 -0.030048
H  4.132545 -3.065521 -0.031924
H  6.758009 -2.228153 -0.008716
H  -7.991417 0.614317 -0.055826
