program: Gaussian 09
title: 000134239
version: EM64L-G09RevD.01
frameworkgroup: C1[X(C17H26INO4S)]
method: RPBEPBE
basis: SDD
operation: Freq
keyword: #p
keyword: freq=noraman
keyword: PBEPBE/SDD
title: #p freq=noraman PBEPBE/SDD
converged: YES YES NO NO
title: Mulliken charges:
elementType: I S O O O O N C C C C C C C C C C C C C C C C C H H H H H H H H H H H H H H H H H H H H H H H H H H
charge: 0.142504 0.997406 -0.529402 -0.532859 -0.418444 -0.230418 -0.524019 -0.386305 -0.373054 -0.383500 -0.354404 -0.384555 -0.393395 -0.368952 -0.374857 -0.375893 -0.487959 -0.067922 0.170788 -0.244644 -0.214547 -0.136864 -0.149265 -0.350641 0.200350 0.195171 0.186781 0.191163 0.191295 0.193074 0.193178 0.235493 0.196672 0.198503 0.199193 0.208761 0.190197 0.191542 0.221510 0.250115 0.218279 0.218401 0.252295 0.251484 0.302542 0.292724 0.291385 0.263134 0.262932 0.375024
chargesum: 0.00000
title: Mulliken charges with hydrogens summed into heavy atoms:
elementType: I S O O O O N C C C C C C C C C C C C C C C C C
charge: 0.142504 0.997406 -0.529402 -0.532859 -0.043420 -0.230418 -0.221478 0.009216 0.004890 0.000869 0.074267 0.010621 0.014560 0.012788 0.096767 0.060788 0.015819 -0.067922 0.170788 0.048080 0.076838 0.126270 0.113668 -0.350641
polarizability: 3.91496526e+02 -3.00011312e+01 1.97003274e+02 -3.83200963e+00 -8.72943139e+00 1.94359988e+02
1716.lowfreq: -13.7372 -4.0339 -2.4182 -0.0020 -0.0010 0.0012 1.9704 5.8474 12.7234
frequency: -10.0587 5.6008 12.5738 18.3782 25.5970 26.5106 35.8142 40.4789 57.6363 68.8853 76.7590 85.9926 99.8087 105.5560 115.3264 134.3728 139.5135 153.3101 159.9180 165.5504 173.3241 181.9303 213.5445 244.4935 257.9865 272.4881 311.0372 318.4738 331.2719 348.8902 365.4149 404.2032 405.7806 419.3290 463.0462 464.8622 483.5353 500.4254 502.1869 526.0572 588.6142 610.2304 640.8045 673.1036 699.9768 717.5223 720.0624 723.4547 735.3690 760.8692 804.5257 814.1379 833.1755 837.3837 856.5654 860.6934 880.0956 923.0601 950.9392 962.8725 974.4900 974.8551 977.2603 990.7128 996.9923 1017.0322 1027.6443 1036.8464 1042.3973 1052.0292 1060.7332 1073.5632 1080.4054 1082.2961 1087.2950 1104.4783 1109.1086 1114.6877 1142.0870 1181.2399 1189.7299 1199.4592 1216.8902 1230.0468 1240.0088 1257.1367 1263.9815 1277.4102 1282.7596 1283.9679 1287.2676 1289.9536 1296.1206 1298.0443 1315.8255 1328.2811 1340.0917 1352.8640 1356.3104 1358.3981 1367.6905 1369.3950 1370.8378 1372.3720 1437.0466 1442.5218 1457.8883 1461.0944 1461.5668 1464.7114 1468.7630 1476.8334 1477.8341 1484.0734 1488.3608 1556.0946 1584.2324 1669.6975 2930.8274 2946.9627 2949.4132 2951.2587 2957.7576 2963.7525 2964.5699 2974.7107 2983.6379 2985.5908 2988.9589 2995.2147 2997.3867 3011.7181 3018.3737 3029.0859 3037.1223 3045.5318 3054.2109 3061.2571 3151.5510 3153.1588 3174.1000 3177.8128 3437.1634 3510.4707
redmass: 4.5676 9.8750 6.6325 6.2745 2.3412 4.2315 4.6575 4.1718 4.2605 3.1503 2.2923 5.3537 4.3453 3.9943 2.0379 3.8361 2.2487 2.1026 8.0926 10.2920 4.0249 2.8413 7.0469 3.2459 4.7631 6.7954 4.5241 8.8512 3.8801 3.5828 4.3106 2.8785 3.7809 4.8263 10.3671 3.2220 3.0304 1.8416 3.3375 2.8533 4.6756 7.0806 1.2996 7.0886 3.4917 2.1379 1.0772 1.0885 1.1335 1.2300 1.4136 5.9471 1.4455 1.2412 4.8624 1.3840 2.0651 1.4954 6.3786 1.3677 2.4936 2.7295 1.4592 4.0812 3.7609 1.3274 3.2066 7.5271 2.7893 1.7962 3.1999 2.6382 2.0586 2.2586 2.4490 1.4208 3.3137 1.4722 1.7621 1.1305 1.3723 1.4016 1.3293 1.3715 1.3792 1.3446 1.3135 1.0400 1.1803 1.2263 1.0787 1.3038 1.0990 1.1241 1.3923 1.2509 1.4193 1.4079 1.6380 1.5919 3.5145 1.9745 2.5984 1.8097 1.0847 2.0492 1.0803 1.0769 1.0702 1.0621 1.0897 1.0955 1.0782 1.0988 1.1001 6.0198 8.0993 8.2195 1.0660 1.0588 1.0587 1.0588 1.0596 1.0616 1.0591 1.0654 1.0952 1.0612 1.0969 1.0597 1.1004 1.0977 1.1037 1.0999 1.1039 1.0953 1.1017 1.1031 1.0895 1.0898 1.0961 1.0970 1.0763 1.0639
irintensity: 0.2389 0.1825 0.3559 0.1756 0.1004 0.0603 1.1325 1.1547 1.3802 0.7187 0.2046 0.8167 1.3488 1.3234 1.1257 6.8455 0.0801 0.4294 0.1742 0.9857 1.0524 1.7176 1.1259 0.2807 7.1804 3.1859 11.9273 27.0202 16.4034 1.9801 41.5510 0.0519 4.7653 13.0492 155.8443 0.6201 61.7403 29.4410 60.0705 20.0325 14.4706 0.5485 130.0322 48.6242 3.0847 22.0410 24.2755 0.1765 7.2162 0.4416 14.7237 130.4905 33.5428 0.6914 1.5533 2.3325 11.8347 1.9988 48.9019 1.7468 36.5233 41.6036 3.7403 51.2913 4.5000 22.5851 113.2063 63.8403 59.4304 0.0394 25.6821 22.3321 0.1734 0.7848 12.5805 5.2223 11.1472 0.9349 28.2166 7.8526 28.6059 18.4728 6.3896 0.8801 0.4937 4.6352 2.9930 0.5154 1.9746 0.7539 1.1328 15.5912 0.0300 1.8486 14.8585 6.4533 4.4255 15.8070 3.1631 1.4256 10.5728 19.2235 7.4132 25.3357 27.7268 49.1938 2.7648 0.2834 0.3992 0.0558 0.4695 2.9288 26.5923 0.8345 32.1104 33.3128 0.2992 207.2295 42.3815 5.2820 0.0518 14.4018 0.0477 44.9307 83.2134 78.1845 6.8937 5.5444 2.5944 38.9533 8.3884 12.3663 2.0713 6.0945 65.9298 14.0767 92.7023 94.0111 3.2014 2.6753 1.7941 2.8752 22.0535 17.9034
temp: 298.150 k
press: 1.00000 atm
elementType: 53 16 8 8 8 8 7 6 6 6 6 6 6 6 6 6 6 6 6 6 6 6 6 6 1 1 1 1 1 1 1 1 1 1 1 1 1 1 1 1 1 1 1 1 1 1 1 1 1 1
symmnumber: 1
zpe: 1058471.6 jmol-1
zpe.correction: 0.403151 hartree
zpe.thermalcorrener: 0.430871 hartree
zpe.thermalcorrenthalpy: 0.431815 hartree
zpe.thermalcorrgfe: 0.336365 hartree
zpe.sumelectzpe: -1426.582154 hartree
zpe.sumelectthermal: -1426.554434 hartree
zpe.sumelectthermalent: -1426.553489 hartree
zpe.sumelectthermalfe: -1426.648940 hartree
dipole: 1.9604 -6.3086 -2.4479
dipole: 7.0451
quadrupole: -156.5831 -186.4726 -165.5426
quadrupole: 6.5219 6.7146 -7.8961
quadrupole: 12.9497 -16.9399 3.9902 6.5219 6.7146 -7.8961
hfenergy: -1426.9853049 hartree
pointgroup: C01 [X(C17H26I1N1O4S1)]
dipole: -0.6712476 2.5664463 -0.8034411 debye
polarizability: 388.7402952|-37.9816218|198.6805034|1.424512|8.9137923|195.4389895 unknown
InChI: InChI=1S/C17H26INO4S/c18-15-10-12-16(13-11-15)24(22,23)19-14-8-6-4-2-1-3-5-7-9-17(20)21/h10-13,19-20H,1-9,14H2
charge 0 multiplicity 1
50 atoms
I  -10.149879 1.43057 0.171571
S  -3.97007 -1.450629 -0.061094
O  -3.533001 -1.697744 1.483382
O  -4.031023 -2.608638 -1.199063
O  11.463546 0.162517 -0.299603
O  10.246819 -1.410377 0.897401
N  -2.770993 -0.233797 -0.704645
C  2.595119 0.420877 0.131085
C  1.39241 1.279144 -0.321468
C  3.957704 0.980956 -0.334867
C  0.033829 0.699548 0.130806
C  5.159177 0.134384 0.141914
C  -1.160919 1.587535 -0.275231
C  6.522741 0.688629 -0.328126
C  -2.534918 0.984024 0.102242
C  7.716952 -0.15625 0.166825
C  9.067309 0.409707 -0.311326
C  -5.694224 -0.645708 -0.000017
C  10.259371 -0.391139 0.173767
C  -6.530411 -0.774603 -1.120967
C  -6.071967 0.024179 1.174767
C  -7.811625 -0.17823 -1.070108
C  -7.352504 0.622244 1.220064
C  -8.204604 0.520525 0.095784
H  2.471553 -0.612779 -0.253398
H  2.591251 0.341569 1.238257
H  1.509584 2.309805 0.075935
H  1.403445 1.369472 -1.428321
H  4.072998 2.021396 0.035816
H  3.968833 1.042897 -1.443431
H  0.035232 0.576093 1.233628
H  -0.107395 -0.311581 -0.295783
H  5.149899 0.077389 1.25034
H  5.041263 -0.907206 -0.22273
H  -1.130833 1.785002 -1.367097
H  -1.08426 2.576517 0.221677
H  6.634533 1.734071 0.029528
H  6.534428 0.736087 -1.437476
H  -3.337571 1.743412 -0.026974
H  -2.51769 0.671092 1.162763
H  7.710458 -0.205079 1.272614
H  7.610427 -1.20044 -0.184674
H  9.114476 0.450934 -1.417478
H  9.203716 1.455538 0.028863
H  -2.942804 -0.102952 -1.714095
H  -6.206549 -1.350533 -1.994283
H  -5.402025 0.051402 2.040316
H  -8.489148 -0.266725 -1.923698
H  -7.677037 1.149397 2.121057
H  12.225378 -0.383203 0.037651
