program: Gaussian 09
title: 000134225
version: EM64L-G09RevD.01
frameworkgroup: C1[X(C17H25NO)]
method: RPBEPBE
basis: SDD
operation: Freq
keyword: #p
keyword: freq=noraman
keyword: PBEPBE/SDD
title: #p freq=noraman PBEPBE/SDD
converged: NO YES NO NO
title: Mulliken charges:
elementType: O N C C C C C C C C C C C C C C C C C H H H H H H H H H H H H H H H H H H H H H H H H H
charge: -0.441472 -0.143563 0.342259 -0.549061 -0.520698 -0.393552 -0.405765 -0.370486 -0.379991 -0.396971 0.300169 -0.400059 -0.397159 -0.400611 0.184677 -0.378155 -0.427283 -0.296414 -0.222162 0.186441 0.281857 0.210628 0.213723 0.186915 0.214474 0.214599 0.186461 0.168383 0.237805 0.225933 0.159543 0.199371 0.184544 0.184477 0.202412 0.203846 0.183903 0.209424 0.185022 0.248334 0.207482 0.225835 0.226029 0.348856
chargesum: 0.00000
title: Mulliken charges with hydrogens summed into heavy atoms:
elementType: O N C C C C C C C C C C C C C C C C C
charge: -0.092617 -0.143563 0.342259 -0.080763 -0.096347 0.007836 -0.004705 0.035702 0.005485 -0.013055 0.300169 -0.013170 -0.009411 -0.006165 0.184677 -0.129821 -0.219801 -0.070579 0.003867
polarizability: 1.94008846e+02 1.67896950e+01 1.92160059e+02 1.21182653e+01 -2.51425207e+00 1.72312283e+02
1716.lowfreq: -11.4657 -9.6745 0.0002 0.0004 0.0005 3.3132 30.8821 48.7398 57.8193
frequency: 29.3021 48.5685 57.7590 79.6826 137.9841 160.8805 166.4483 179.1704 222.7561 255.1888 260.3063 268.2684 290.7575 313.1999 323.9462 339.6787 370.3767 385.3308 399.6508 434.2050 445.6001 446.8772 485.6725 493.8949 506.0752 534.2247 550.9168 572.2647 621.2047 660.7975 726.4774 751.5663 774.2728 788.2268 800.5268 807.9805 823.8809 839.1498 852.0604 853.4791 871.1856 905.0834 909.3815 921.1268 932.1757 935.9201 958.2810 960.6405 968.2504 1016.8492 1036.5410 1045.0422 1052.5903 1061.4447 1073.6707 1079.7579 1087.4911 1103.7535 1120.3481 1123.7702 1134.4085 1144.1979 1152.6768 1166.6245 1173.7237 1186.1891 1195.0476 1232.0321 1240.7467 1255.8607 1259.9808 1266.8216 1281.5665 1290.9035 1294.5162 1305.6373 1319.9151 1330.6814 1335.1484 1337.8157 1342.8359 1344.9648 1345.7739 1356.3318 1360.7042 1379.7832 1386.4940 1427.4268 1447.2492 1458.0886 1460.4682 1461.9210 1464.6542 1465.4550 1473.0612 1475.7713 1477.8661 1486.7399 1499.6134 1592.3845 1606.3017 2801.6945 2827.9127 2960.2223 2961.5062 2971.0286 2977.7854 2979.3125 2979.5521 2980.2825 2989.0157 3022.1748 3026.1510 3026.5065 3034.2503 3039.1263 3042.8265 3045.4711 3049.4953 3074.6060 3093.2238 3098.7090 3133.6093 3154.1968 3171.2469 3555.4982
redmass: 3.0112 3.9771 4.4910 3.5131 2.9915 2.7252 3.7365 3.5401 2.0776 3.2885 2.7830 3.2882 2.7239 2.8400 1.8296 1.4261 2.1164 1.9563 3.0593 3.1321 3.0943 2.9711 2.2664 3.1705 1.9519 4.1993 2.8462 3.8810 2.5862 4.5662 3.1052 1.4192 2.7253 1.5242 3.8762 1.4873 2.8026 1.5703 2.0371 1.7283 2.0445 2.2806 2.4850 1.8937 1.5688 1.4059 1.2937 2.6476 1.3120 2.5465 2.1945 2.4609 2.1312 1.9936 1.9088 2.0664 1.3930 1.6417 2.1539 2.3171 1.6620 1.3671 1.9959 1.2849 1.1034 1.8916 1.8773 2.5414 2.2085 1.2752 1.2983 1.1898 1.2614 1.6044 1.4153 1.5015 1.3257 1.3292 1.3787 1.3952 1.4791 1.4546 1.3813 1.4128 1.3480 1.3598 5.5579 2.2547 1.0919 1.0875 1.0910 1.0898 1.0899 1.0874 1.0985 1.0967 1.1043 1.4071 1.5215 6.2055 6.3467 1.0711 1.0702 1.0620 1.0618 1.0624 1.0611 1.0597 1.0633 1.0634 1.0670 1.0964 1.0965 1.0969 1.1015 1.1000 1.0906 1.1012 1.1021 1.0862 1.0952 1.0888 1.0871 1.0940 1.0970 1.0657
irintensity: 0.4771 0.1178 0.1962 1.1695 0.1652 0.2761 0.5345 1.1642 0.9533 0.9689 1.5892 0.3802 11.8630 5.8979 23.0332 68.0411 2.7998 0.6280 11.3739 1.4561 1.7798 0.7052 2.1369 6.1745 7.3799 4.9498 0.7767 0.7155 5.7522 1.7390 10.5795 82.1172 1.6176 2.4296 13.2370 0.2968 8.0347 1.0116 3.8749 2.4877 16.6509 8.1889 7.2081 0.9819 2.2048 2.2925 1.6851 47.1704 0.5997 15.0199 16.6224 3.6758 1.9878 12.0444 46.2927 33.3040 6.3652 3.3198 14.7800 12.5781 14.6300 6.7958 14.8518 64.6894 15.9475 16.0432 13.3811 9.5371 14.1791 4.6752 1.1257 13.0051 1.2305 15.2408 1.3969 44.1079 1.7458 1.3421 1.1516 0.4261 3.4216 1.1072 8.9925 1.7778 3.1859 1.7725 4.1252 36.4715 5.2318 13.1327 9.0177 5.6318 5.4379 4.2129 11.9081 2.5873 8.3407 30.9212 6.8532 10.4098 9.0336 91.6379 124.1692 39.6246 34.4752 24.4514 48.2016 73.7135 49.5950 8.6293 36.4460 72.6130 70.2043 45.7150 8.4540 38.1109 3.8055 113.2350 110.3475 32.2895 3.4102 18.1363 6.0547 29.9505 16.0246 17.7287
temp: 298.150 k
press: 1.00000 atm
elementType: 8 7 6 6 6 6 6 6 6 6 6 6 6 6 6 6 6 6 6 1 1 1 1 1 1 1 1 1 1 1 1 1 1 1 1 1 1 1 1 1 1 1 1 1
symmnumber: 1
zpe: 1013450.5 jmol-1
zpe.correction: 0.386003 hartree
zpe.thermalcorrener: 0.403451 hartree
zpe.thermalcorrenthalpy: 0.404395 hartree
zpe.thermalcorrgfe: 0.341475 hartree
zpe.sumelectzpe: -791.299255 hartree
zpe.sumelectthermal: -791.281807 hartree
zpe.sumelectthermalent: -791.280863 hartree
zpe.sumelectthermalfe: -791.343783 hartree
dipole: -0.3927 -0.7676 0.4214
dipole: 0.9597
quadrupole: -116.2782 -109.2345 -108.8871
quadrupole: 4.5818 0.1638 -5.3781
quadrupole: -4.8116 2.2321 2.5795 4.5818 0.1638 -5.3781
hfenergy: -791.6852578 hartree
pointgroup: C01 [X(C17H25N1O1)]
dipole: 0.2184616 0.2560201 0.1711456 debye
polarizability: 201.8026113|14.583425|184.5414042|-10.6755899|5.5794205|172.1371727 unknown
InChI: InChI=1S/C17H25NO/c19-16-10-4-3-9-15(16)17(11-5-1-6-12-17)18-13-7-2-8-14-18/h3-4,9-10,19H,1-2,5-8,11-14H2
charge 0 multiplicity 1
44 atoms
O  0.546843 0.989242 2.204724
N  -1.421417 0.093691 -0.016174
C  -0.181507 -0.781069 -0.044609
C  -0.108714 -1.689881 1.226113
C  -0.20604 -1.757708 -1.276389
C  1.122111 -2.62494 1.214573
C  0.935769 -2.808817 -1.311055
C  -1.668714 0.856357 -1.264302
C  -2.677718 -0.468498 0.527368
C  1.048746 -3.595574 0.014468
C  1.018114 0.208451 -0.073566
C  -2.638937 2.030622 -1.014463
C  -3.697837 0.656767 0.819485
C  -3.973655 1.510281 -0.437041
C  1.316143 1.072485 1.026139
C  1.827486 0.374919 -1.226761
C  2.371445 2.015484 0.962879
C  2.881111 1.313276 -1.306998
C  3.15911 2.140463 -0.199578
H  -1.00514 -2.339979 1.244398
H  -0.123578 -1.064283 2.131445
H  -0.222779 -1.195343 -2.229209
H  -1.175899 -2.294245 -1.223832
H  1.155107 -3.193075 2.164754
H  2.056232 -2.031047 1.163844
H  1.904882 -2.310942 -1.505408
H  0.762654 -3.505776 -2.155522
H  -2.109382 0.208411 -2.067809
H  -0.706059 1.24243 -1.642642
H  -2.469536 -0.99768 1.469938
H  -3.151768 -1.205316 -0.177226
H  1.935793 -4.258178 -0.011534
H  0.160343 -4.250315 0.135444
H  -2.808249 2.576138 -1.963806
H  -2.170634 2.732957 -0.29801
H  -3.282546 1.301434 1.61819
H  -4.635839 0.205936 1.200033
H  -4.654019 2.349946 -0.197487
H  -4.484356 0.887171 -1.20142
H  1.623946 -0.242553 -2.105605
H  2.572745 2.657783 1.832042
H  3.471782 1.395923 -2.225359
H  3.9711 2.874823 -0.235001
H  0.840962 1.684028 2.846268
