program: Gaussian 09
title: 000134224
version: EM64L-G09RevD.01
frameworkgroup: C1[X(C11H12N2O3)]
method: RPBEPBE
basis: SDD
operation: Freq
keyword: #p
keyword: freq=noraman
keyword: PBEPBE/SDD
title: #p freq=noraman PBEPBE/SDD
converged: YES YES NO NO
title: Mulliken charges:
elementType: O O O N N C C C C C C C C C C C H H H H H H H H H H H H
charge: -0.190001 -0.248834 -0.276132 -0.095057 -0.374311 -0.235917 0.504270 -0.367665 0.141087 -0.398244 -0.358926 0.258411 -0.230643 -0.225438 -0.747881 -0.233040 0.288612 0.332788 0.262992 0.247333 0.264178 0.243630 0.231179 0.229285 0.251830 0.239198 0.254772 0.232523
chargesum: 0.00000
title: Mulliken charges with hydrogens summed into heavy atoms:
elementType: O O O N N C C C C C C C C C C C
charge: -0.190001 -0.248834 -0.276132 -0.095057 -0.041523 0.052695 0.504270 0.142661 0.141087 -0.134066 -0.115295 0.258411 0.000536 0.003848 -0.002081 -0.000517
polarizability: 1.63761007e+02 -1.27127769e+01 1.44698244e+02 2.29771845e+00 -1.79813459e+01 1.02976090e+02
1716.lowfreq: -11.8769 -3.8286 -0.0004 0.0003 0.0005 2.0404 32.1820 44.8125 55.2338
frequency: 31.9949 44.7026 55.2182 66.9951 75.2667 111.0915 135.4673 188.6031 225.9942 248.9709 300.3201 324.8373 379.7291 396.2140 403.6495 464.0022 484.3566 531.1289 544.4739 548.0362 560.3727 614.0635 629.4226 661.2685 681.1479 706.3117 769.4689 796.6629 823.4865 854.5400 856.7246 922.4453 933.0628 947.8639 981.0502 990.6010 996.3246 1001.3137 1024.1454 1033.1355 1041.0903 1048.3694 1087.9085 1126.6163 1174.4074 1189.2479 1197.1590 1198.9341 1272.4229 1295.8702 1313.4429 1344.2631 1361.1087 1376.4047 1382.8764 1389.2087 1408.6202 1429.8344 1445.1551 1445.4085 1455.6138 1482.0892 1590.4130 1596.5091 1611.6210 1631.7280 3004.5215 3006.8545 3026.3213 3092.1752 3113.6915 3126.9748 3133.1863 3138.2965 3144.0052 3154.4517 3167.6115 3530.7383
redmass: 3.9973 5.0155 4.6803 3.5903 1.2385 3.9806 3.8629 5.4384 4.7548 4.4247 5.8244 5.2139 6.4182 5.9446 2.9034 3.2966 2.5672 4.6815 4.6934 3.1730 4.5055 6.3760 5.9907 2.5922 2.0965 1.6472 2.2263 4.8055 4.3006 3.8052 1.2476 4.6276 1.5909 2.9242 1.4400 5.0583 2.1664 1.3458 2.3706 1.7626 2.1940 2.6670 1.6605 4.4739 1.0594 1.1326 2.3908 1.2051 1.7080 1.4686 1.3526 1.8073 2.2225 2.4203 1.3295 3.9553 1.9822 1.1480 1.6143 1.3119 1.0531 2.2227 7.4536 6.1676 5.9868 6.2168 1.0370 1.0631 1.0846 1.0973 1.1004 1.0850 1.0882 1.1008 1.0923 1.0963 1.1015 1.0766
irintensity: 0.0066 0.5381 0.6863 3.9225 0.4027 3.1343 2.3357 10.3263 2.1175 5.3782 0.3159 5.9050 9.9261 24.5732 3.2673 6.9131 8.2948 25.3836 5.9820 4.2506 13.0723 0.4689 23.3541 76.4548 58.9633 55.3052 48.9532 6.6994 27.9952 17.0661 1.0048 52.0472 6.0695 5.7659 0.8848 1.7302 11.1744 0.7462 6.3503 4.8323 3.7619 6.5327 15.4003 33.5566 0.6040 6.4989 11.4159 5.0675 74.9120 33.0946 25.9761 120.5561 69.0818 101.2577 85.9999 4.4097 35.1496 4.5692 4.0397 35.3668 23.1545 9.9908 132.4016 17.7810 1.7723 406.4141 4.9366 22.6361 1.8857 10.1690 2.9975 0.6176 1.5510 8.6233 13.7379 27.0637 19.1414 30.6896
temp: 298.150 k
press: 1.00000 atm
elementType: 8 8 8 7 7 6 6 6 6 6 6 6 6 6 6 6 1 1 1 1 1 1 1 1 1 1 1 1
symmnumber: 1
zpe: 567506.1 jmol-1
zpe.correction: 0.216152 hartree
zpe.thermalcorrener: 0.230786 hartree
zpe.thermalcorrenthalpy: 0.231731 hartree
zpe.thermalcorrgfe: 0.172840 hartree
zpe.sumelectzpe: -760.338991 hartree
zpe.sumelectthermal: -760.324357 hartree
zpe.sumelectthermalent: -760.323413 hartree
zpe.sumelectthermalfe: -760.382303 hartree
dipole: -1.3232 0.5703 1.5516
dipole: 2.1175
quadrupole: -85.5684 -106.8844 -91.1781
quadrupole: 10.4578 4.3527 1.5672
quadrupole: 8.9752 -12.3408 3.3655 10.4578 4.3527 1.5672
hfenergy: -760.5551431 hartree
pointgroup: C01 [X(C11H12N2O3)]
dipole: -0.5070864 -0.2279392 -0.620433 debye
polarizability: 163.2880055|13.3553552|145.6024772|-0.9143762|-17.3618133|102.544858 unknown
InChI: InChI=1S/C11H12N2O3/c1-8(14)13-11(12-10(15)7-16-13)9-5-3-2-4-6-9/h2-6,11-12H,7H2,1H3
charge 0 multiplicity 1
28 atoms
O  1.594869 -0.078232 -1.173385
O  2.574774 2.963365 0.643552
O  0.703713 -2.763222 1.076925
N  1.162104 -0.763928 0.035126
N  0.946345 1.358026 1.087153
C  0.282493 0.047299 0.898497
C  -1.149647 0.174535 0.368071
C  2.573743 0.958302 -0.73812
C  2.031849 1.848966 0.386046
C  -2.115474 -0.775951 0.783749
C  -1.51664 1.195161 -0.542145
C  1.259393 -2.154996 0.11216
C  -3.436447 -0.707527 0.289145
C  -2.838174 1.262058 -1.035597
C  2.046139 -2.831952 -0.994278
C  -3.800832 0.312202 -0.62083
H  0.26127 -0.502655 1.85813
H  0.559958 1.975784 1.806314
H  2.756008 1.574453 -1.632445
H  3.517631 0.482473 -0.410525
H  -1.823577 -1.574511 1.476046
H  -0.773669 1.935391 -0.857787
H  -4.178776 -1.444877 0.613541
H  -3.118609 2.053519 -1.739409
H  2.136227 -3.899894 -0.747458
H  3.049693 -2.387639 -1.10976
H  1.527227 -2.718656 -1.962429
H  -4.826791 0.368207 -1.001489
