program: Gaussian 09
title: 000134222
version: EM64L-G09RevD.01
frameworkgroup: C1[X(C19H23ClN2O)]
method: RPBEPBE
basis: SDD
operation: Freq
keyword: #p
keyword: freq=noraman
keyword: PBEPBE/SDD
title: #p freq=noraman PBEPBE/SDD
converged: YES YES NO NO
title: Mulliken charges:
elementType: Cl O N N C C C C C C C C C C C C C C C C C C C H H H H H H H H H H H H H H H H H H H H H H H
charge: -0.081708 -0.447427 -0.286121 -0.099462 -0.416558 0.283193 0.166963 -0.574719 -0.525425 0.207595 0.364430 -0.422812 -0.348169 0.144752 -0.351764 -0.242832 -0.359853 -0.433397 -0.219473 -0.155303 -0.310720 -0.617918 -0.612536 0.200296 0.270430 0.211760 0.251608 0.242360 0.221948 0.204078 0.243026 0.192340 0.215587 0.249785 0.268295 0.232558 0.218169 0.225148 0.254779 0.189292 0.223713 0.224009 0.188157 0.235717 0.218930 0.357280
chargesum: 0.00000
title: Mulliken charges with hydrogens summed into heavy atoms:
elementType: Cl O N N C C C C C C C C C C C C C C C C C C C
charge: -0.081708 -0.090147 -0.286121 -0.099462 0.054167 0.283193 0.166963 -0.111351 -0.061117 0.207595 0.364430 0.024292 0.059758 0.144752 -0.101979 0.025463 -0.127295 -0.215227 0.005675 -0.155303 -0.055941 0.019095 0.030269
polarizability: 2.98443880e+02 -3.07648954e+01 2.13301136e+02 1.32607623e+01 2.90913537e+01 1.93704608e+02
1716.lowfreq: -4.1216 -0.0013 -0.0012 0.0001 5.5800 7.2274 19.7879 24.5910 37.8378
frequency: 19.5842 24.5600 37.8091 43.1116 67.2421 69.7951 99.0161 111.2249 138.6378 156.9626 186.0801 202.4369 222.9823 227.1340 233.2415 269.5661 293.1184 301.5119 314.9869 339.4141 347.7140 351.1206 364.4708 378.2028 388.2991 401.3127 412.8054 436.4437 445.5544 493.8866 502.4820 526.7031 536.9602 554.0402 564.0613 597.8551 620.6839 642.2904 657.3430 697.0932 727.1135 740.1788 741.7015 773.9737 786.3279 797.5085 826.5045 847.0139 854.2744 865.4813 878.1134 894.3950 932.3778 944.4395 949.3027 968.2058 995.4169 1015.6157 1035.4766 1048.2337 1056.6141 1075.6793 1078.7412 1087.3610 1097.0544 1107.9892 1126.2917 1136.0581 1151.9414 1158.2612 1166.6246 1183.8737 1198.0582 1213.3046 1215.3422 1225.7844 1238.3585 1257.3628 1263.5947 1268.9174 1288.1150 1296.1080 1316.5571 1323.5336 1346.6079 1352.8282 1357.5320 1365.1142 1373.4212 1393.6210 1408.2126 1418.1048 1438.3575 1452.8541 1457.0505 1458.1571 1462.3668 1466.4746 1470.2203 1476.0354 1476.9671 1479.3231 1485.0790 1492.7854 1499.7410 1568.4786 1593.6408 1599.3224 1618.6985 2848.1496 2852.4817 2868.9192 2944.9396 2968.3040 2993.9457 2997.6778 3016.7695 3020.4103 3023.8853 3029.6271 3052.7751 3069.0671 3074.8817 3081.0979 3086.6035 3118.0584 3119.8390 3142.8110 3165.3779 3178.3096 3187.2044 3586.1554
redmass: 3.7574 4.1535 5.0674 3.1468 4.9860 4.2805 5.0335 3.9572 3.1389 3.1965 5.5730 3.6571 3.5173 1.2116 1.2333 4.6150 2.6989 3.1397 2.9092 3.8753 3.6414 1.2603 2.9750 3.1379 2.5112 3.8311 2.0808 2.9319 2.8590 4.4448 2.5738 3.9355 4.0016 4.9905 3.6055 3.9884 4.9312 4.6157 6.0299 3.1495 2.2766 2.6191 2.5089 2.6023 3.2513 1.5630 2.8463 1.4984 1.5885 2.2331 2.7815 2.2961 1.4916 1.8628 1.4145 2.1477 2.4517 2.2075 1.5312 2.6968 2.5288 1.9031 2.0333 1.4735 2.2033 2.1703 1.6425 1.4927 1.2629 1.6140 1.2619 1.5938 2.0161 1.3811 2.1516 1.7574 1.7058 1.7838 1.7972 2.1462 1.3786 1.3543 1.8103 1.7733 1.3769 1.5171 1.9366 1.8137 2.0749 4.9706 2.8946 1.1415 1.1496 2.1024 1.3005 1.0869 1.0509 1.1224 1.1066 1.0640 1.0852 2.0952 1.0552 2.1278 1.3476 7.3053 7.3207 7.4468 6.7614 1.0569 1.0650 1.0627 1.0693 1.0607 1.0683 1.0628 1.0730 1.0972 1.0724 1.0865 1.0976 1.0931 1.1008 1.1003 1.0957 1.0881 1.0896 1.0905 1.0981 1.0952 1.0904 1.0660
irintensity: 0.3844 0.1936 0.0747 0.5286 0.5155 0.5197 0.3582 0.1464 1.7116 1.9894 1.1468 1.7182 2.7503 1.2321 0.8945 0.8999 1.9964 9.7231 2.5057 8.0838 22.0470 101.6185 9.8819 6.7003 1.5726 3.7791 3.2911 8.7499 6.4477 1.1281 0.6033 4.5283 0.6850 11.0097 2.9664 7.6727 9.4663 6.4824 3.4752 6.4536 26.1516 42.3626 11.1424 40.1513 37.2256 30.6203 8.0505 30.4011 1.7705 0.1443 18.8165 10.9500 12.2823 60.0526 20.0013 10.1913 61.4170 71.9053 13.8612 33.1435 46.9850 28.1792 8.7550 4.6853 28.1761 9.5034 36.9029 10.3376 74.3638 8.1321 4.9154 5.9159 36.7227 31.2987 6.8974 38.9477 28.7222 39.0119 11.1496 9.1669 10.4569 11.2339 44.4320 39.8079 13.4790 4.2933 6.2975 2.3664 8.4370 8.3485 58.2567 2.1568 2.7095 142.3650 0.2487 3.1629 9.3429 7.8111 15.8371 25.8914 16.8314 224.5311 13.4353 29.5309 4.5764 19.3291 122.7549 119.1226 36.6254 75.3902 55.3912 264.0921 50.9488 30.6092 18.5089 31.9017 31.9579 38.1377 47.2400 16.9720 36.4408 13.9156 37.2791 43.3475 8.3790 11.4309 15.3033 19.1154 14.1521 3.4981 1.3158 32.2370
temp: 298.150 k
press: 1.00000 atm
elementType: 17 8 7 7 6 6 6 6 6 6 6 6 6 6 6 6 6 6 6 6 6 6 6 1 1 1 1 1 1 1 1 1 1 1 1 1 1 1 1 1 1 1 1 1 1 1
symmnumber: 1
zpe: 995108.8 jmol-1
zpe.correction: 0.379017 hartree
zpe.thermalcorrener: 0.401078 hartree
zpe.thermalcorrenthalpy: 0.402022 hartree
zpe.thermalcorrgfe: 0.326636 hartree
zpe.sumelectzpe: -1380.882416 hartree
zpe.sumelectthermal: -1380.860355 hartree
zpe.sumelectthermalent: -1380.859411 hartree
zpe.sumelectthermalfe: -1380.934797 hartree
dipole: 4.2055 -0.1307 -0.3302
dipole: 4.2205
quadrupole: -145.9910 -131.1096 -140.0244
quadrupole: -3.8747 6.7005 2.1029
quadrupole: -6.9493 7.9320 -0.9827 -3.8747 6.7005 2.1029
hfenergy: -1381.261433 hartree
pointgroup: C01 [X(C19H23Cl1N2O1)]
dipole: -1.632752 0.1474462 -0.2636042 debye
polarizability: 296.6174338|-32.5581787|218.3443875|-6.9788142|-30.5418733|190.487803 unknown
InChI: InChI=1S/C19H23ClN2O/c1-21(2)11-4-12-22-17-5-3-6-19(23)16(17)10-8-14-7-9-15(20)13-18(14)22/h3,5-7,9,13,23H,4,8,10-12H2,1-2H3
charge 0 multiplicity 1
46 atoms
Cl 5.269907 -1.040046 1.232269
O  -2.884343 3.250519 -1.019232
N  0.162006 -0.243861 0.518897
N  -2.039197 -3.131065 -0.665725
C  -0.008489 -1.62629 1.05143
C  -0.92387 0.669507 0.773859
C  1.473383 0.210318 0.165108
C  -0.701985 1.52527 -1.601901
C  0.714763 2.135476 -1.489186
C  -1.387096 1.527662 -0.257115
C  1.749159 1.307368 -0.723981
C  0.352948 -2.718883 0.018859
C  -0.6751 -2.780208 -1.132348
C  -2.466193 2.400791 0.030056
C  -1.558355 0.667472 2.046199
C  2.585512 -0.486182 0.737158
C  3.103646 1.656757 -0.958684
C  -3.105508 2.408432 1.290908
C  -2.644283 1.528671 2.294746
C  3.900703 -0.100199 0.456314
C  4.20107 0.980331 -0.388034
C  -2.194466 -4.566059 -0.355424
C  -3.098525 -2.644853 -1.573163
H  0.552368 -1.77978 1.997706
H  -1.080474 -1.75369 1.277019
H  -0.623342 0.488346 -1.982867
H  -1.293084 2.111833 -2.323134
H  0.62001 3.136574 -1.022352
H  1.113401 2.309583 -2.507744
H  0.396741 -3.691367 0.547842
H  1.358779 -2.547403 -0.40688
H  -0.311804 -3.490921 -1.917663
H  -0.724693 -1.779979 -1.601925
H  -1.18574 0.013605 2.840057
H  2.42094 -1.313807 1.428497
H  3.305303 2.4918 -1.641177
H  -3.944031 3.088249 1.489108
H  -3.124025 1.530299 3.279315
H  5.231839 1.270875 -0.604461
H  -2.077735 -5.223875 -1.254949
H  -3.196498 -4.747026 0.073351
H  -1.44728 -4.88176 0.393192
H  -3.065074 -3.111648 -2.590605
H  -3.011141 -1.550201 -1.692888
H  -4.090034 -2.860693 -1.13514
H  -3.660812 3.792455 -0.734115
