program: Gaussian 09
title: 000134220
version: EM64L-G09RevD.01
frameworkgroup: C1[X(C11H14BrN2O8P)]
method: RPBEPBE
basis: SDD
operation: Freq
keyword: #p
keyword: freq=noraman
keyword: PBEPBE/SDD
title: #p freq=noraman PBEPBE/SDD
converged: NO YES NO NO
title: Mulliken charges:
elementType: Br P O O O O O O O O N N C C C C C C C C C C C H H H H H H H H H H H H H H
charge: 0.061403 1.384053 -0.263293 -0.425307 -0.519754 -0.256203 -0.681256 -0.685901 -0.242367 -0.569664 -0.190991 -0.404427 -0.140532 -0.065011 -0.546545 0.004263 -0.296366 -0.222872 0.199283 0.198505 0.102014 -0.044659 -0.691682 0.226796 0.299088 0.240702 0.292403 0.290564 0.239453 0.261279 0.345256 0.316784 0.367129 0.278516 0.419484 0.408625 0.311227
chargesum: 0.00000
title: Mulliken charges with hydrogens summed into heavy atoms:
elementType: Br P O O O O O O O O N N C C C C C C C C C C C
charge: 0.061403 1.384053 -0.263293 -0.080051 -0.519754 -0.256203 -0.261772 -0.277275 -0.242367 -0.569664 -0.190991 -0.037298 0.086264 0.234077 -0.013439 0.294827 0.204367 0.093912 0.199283 0.198505 0.102014 0.233857 -0.380455
polarizability: 3.05030568e+02 1.66836021e+01 1.98864047e+02 2.27396592e+00 1.76060829e+01 1.24869521e+02
1716.lowfreq: -3.1081 -0.0012 0.0002 0.0011 2.8256 4.1714 19.7110 38.9112 42.8591
frequency: 19.6575 38.8985 42.8449 48.7891 58.2149 61.1642 78.4704 89.5742 107.6036 128.8370 152.3751 155.5249 169.5574 176.0998 178.7485 187.4865 209.0441 221.2951 264.1827 271.9158 281.1529 306.4667 322.2390 330.0693 333.6218 354.0144 362.5041 391.6736 403.5302 405.0495 433.7786 448.6172 506.2171 523.6920 546.9409 556.2458 614.7940 640.3938 662.6678 699.6699 704.4330 720.8782 722.3405 732.3713 740.3603 762.3177 774.2757 782.3834 806.4664 817.5172 865.0889 872.4901 935.6288 946.3534 960.6314 963.8376 990.6990 996.8365 1015.9536 1036.8212 1047.3536 1053.7200 1054.8697 1077.9279 1089.9714 1103.2077 1127.2761 1167.0906 1186.8500 1193.3584 1217.6624 1228.0704 1233.4409 1254.6572 1269.8810 1278.5975 1285.3029 1314.1054 1325.8295 1336.8690 1357.3306 1367.4577 1368.2951 1387.7598 1410.0066 1456.9705 1470.3074 1593.0530 1596.2975 1629.9419 1650.7508 2979.8100 2992.5724 3038.7063 3062.7814 3064.2160 3100.7052 3114.6081 3119.2660 3157.1480 3161.5437 3361.4440 3522.4621 3568.4801 3613.0339
redmass: 10.4716 12.8151 9.5016 9.3200 11.1307 6.9282 5.9724 5.7175 5.2512 7.1071 2.7253 6.3775 3.4495 5.3003 5.3591 2.4125 5.6859 4.0616 5.5833 5.6578 1.1888 4.5764 3.8928 5.9756 6.5229 8.2693 5.3552 7.2480 9.2360 7.1704 3.5791 2.7838 6.9975 3.3233 1.1452 4.7387 5.0979 11.4321 4.4437 5.6507 2.7066 5.5370 3.9778 6.7614 11.1938 6.2870 4.4291 1.9982 3.5533 2.0709 2.9200 3.4030 3.0308 2.5200 5.7587 1.3108 1.9684 1.1912 1.2175 3.7285 4.4020 2.2292 2.0687 2.8406 2.6818 2.2744 4.7739 1.4351 1.3260 1.8628 1.1534 1.9200 1.2971 1.3822 1.5881 1.3964 1.3798 1.5166 1.2892 1.5071 2.0210 1.5868 1.4078 1.5634 4.3867 1.0886 1.0842 5.7006 6.1243 11.9496 5.7561 1.0826 1.0598 1.0651 1.1046 1.0880 1.0893 1.1012 1.0901 1.0946 1.0931 1.0675 1.0771 1.0664 1.0665
irintensity: 1.4574 1.6299 0.4195 0.5446 0.3070 11.7511 1.5952 1.9604 0.5026 1.0298 28.4403 11.6897 2.2190 6.7828 17.5939 35.9177 6.1946 21.9159 13.4171 10.5546 128.1560 2.3169 21.9015 8.2619 55.0148 64.9293 26.7190 15.6366 36.4873 2.1674 2.1824 3.7713 52.3752 12.6080 116.6839 37.1201 2.9398 16.4707 3.3325 12.2798 5.3897 143.3289 5.8712 140.0060 183.7489 27.2357 12.8354 67.6629 26.2297 71.5185 11.8163 4.9407 52.5397 37.8855 149.6695 7.1164 13.0116 106.0498 77.3470 78.1516 83.6259 36.7311 64.2086 10.3701 18.9787 88.6580 13.3136 43.5074 18.0787 1.0179 9.7281 28.3486 10.0443 19.6519 211.6072 30.2652 5.3592 28.8806 4.2764 111.2914 47.2468 14.9187 7.6496 1.0959 151.6078 12.5335 14.9806 15.3132 21.3440 313.6179 825.9014 34.2085 27.6626 11.5388 14.1330 9.6267 9.7800 10.9834 12.0131 30.4373 10.7648 451.8782 71.1265 11.4826 86.2888
temp: 298.150 k
press: 1.00000 atm
elementType: 35 15 8 8 8 8 8 8 8 8 7 7 6 6 6 6 6 6 6 6 6 6 6 1 1 1 1 1 1 1 1 1 1 1 1 1 1
symmnumber: 1
zpe: 681406.7 jmol-1
zpe.correction: 0.259534 hartree
zpe.thermalcorrener: 0.283358 hartree
zpe.thermalcorrenthalpy: 0.284302 hartree
zpe.thermalcorrgfe: 0.204240 hartree
zpe.sumelectzpe: -1491.794181 hartree
zpe.sumelectthermal: -1491.770357 hartree
zpe.sumelectthermalent: -1491.769413 hartree
zpe.sumelectthermalfe: -1491.849475 hartree
dipole: 5.5833 -1.6542 3.7362
dipole: 6.9188
quadrupole: -144.1427 -165.8001 -153.1936
quadrupole: -3.1637 3.4404 -17.3510
quadrupole: 10.2361 -11.4213 1.1852 -3.1637 3.4404 -17.3510
hfenergy: -1492.0537149 hartree
pointgroup: C01 [X(C11H14Br1N2O8P1)]
dipole: 0.2395109 -2.112295 -1.7001154 debye
polarizability: 208.7546086|35.4545949|290.2025636|27.38148|18.8483339|129.8069645 unknown
InChI: InChI=1S/C11H14BrN2O8P/c12-2-1-6-4-14(11(17)13-10(6)16)9-3-7(15)8(22-9)5-21-23(18,19)20/h1-2,4,7-9,13,15,18-19H,3,5H2
charge 0 multiplicity 1
37 atoms
Br 1.03675 5.064367 1.176583
P  3.305069 1.162089 -0.218365
O  0.375851 -1.827527 1.17461
O  0.843407 -4.715924 0.437463
O  2.650868 -0.290351 0.418801
O  -3.356455 -1.916398 -0.721728
O  2.101601 1.795605 -1.279182
O  4.375748 0.501628 -1.381745
O  -3.267747 2.741328 -1.141957
O  3.83915 2.133795 0.905929
N  -1.479858 -0.754319 0.079528
N  -3.273365 0.424349 -0.89659
C  0.863792 -3.536541 -0.433181
C  1.506297 -2.408632 0.397494
C  -0.554016 -2.989124 -0.73542
C  -0.874369 -2.084879 0.485998
C  2.1923 -1.364972 -0.491025
C  -0.84351 0.447975 0.345543
C  -2.757078 -0.82193 -0.526996
C  -1.375363 1.675688 -0.020054
C  -2.677134 1.707036 -0.720732
C  -0.746791 2.981414 0.213865
C  0.368189 3.24717 0.953534
H  1.42614 -3.747216 -1.366272
H  2.210064 -2.804088 1.145836
H  -0.548642 -2.392024 -1.664346
H  -1.307715 -3.782229 -0.852991
H  -1.579848 -2.555337 1.190108
H  1.506854 -0.941054 -1.250672
H  3.069346 -1.809183 -0.996028
H  0.336293 -5.44361 -0.003373
H  0.111619 0.334685 0.866795
H  -4.192424 0.409675 -1.351189
H  -1.279608 3.810807 -0.271059
H  1.474441 2.451066 -0.851941
H  4.819433 1.151477 -1.981775
H  0.943813 2.538184 1.557437
