program: Gaussian 09
title: 000134213
version: EM64L-G09RevD.01
frameworkgroup: C1[X(C4H9NOS)]
method: RPBEPBE
basis: SDD
operation: Freq
keyword: #p
keyword: freq=noraman
keyword: PBEPBE/SDD
title: #p freq=noraman PBEPBE/SDD
converged: YES YES NO NO
title: Mulliken charges:
elementType: S O N C C C C H H H H H H H H H
charge: 0.127404 -0.261995 -0.604057 -0.463943 -0.625414 0.248446 -0.837228 0.277831 0.237131 0.252858 0.206807 0.259154 0.257565 0.262422 0.329325 0.333695
chargesum: 0.00000
title: Mulliken charges with hydrogens summed into heavy atoms:
elementType: S O N C C C C
charge: 0.127404 -0.261995 0.058963 -0.186112 0.071382 0.248446 -0.058088
polarizability: 9.04472471e+01 -4.58074012e+00 7.10228191e+01 2.32549022e+00 3.12078373e+00 5.00471116e+01
1716.lowfreq: -18.9829 -11.2718 -0.0035 -0.0034 -0.0022 9.0414 27.8299 67.1930 136.6701
frequency: 27.3535 67.1886 136.6555 180.9356 208.1562 243.1099 298.9468 327.8705 409.0428 482.2433 595.0186 630.9631 647.1009 662.3802 719.1392 793.1393 965.6444 969.9118 1003.1852 1064.2237 1073.3784 1098.4954 1210.8073 1266.4348 1338.3854 1344.1498 1390.2483 1449.1067 1457.6841 1461.5495 1471.0091 1569.9391 1635.4425 2998.2328 3002.5961 3005.8354 3097.9608 3106.2058 3121.7464 3131.7332 3471.8380 3646.2280
redmass: 3.9533 4.5603 1.0869 2.7039 1.0662 4.6551 3.2379 4.0922 4.3491 2.9089 1.8423 1.5365 1.4536 5.6142 3.2647 2.8355 1.1829 1.2322 1.5445 1.8449 1.6537 2.6408 1.2253 1.3522 3.8474 1.1348 1.1991 1.0533 1.0505 1.0469 1.0527 1.3800 4.4662 1.0377 1.0711 1.0376 1.1003 1.1004 1.1058 1.1027 1.0473 1.1019
irintensity: 2.1357 6.1373 0.3440 2.5336 0.0145 11.1443 1.8701 5.1536 4.5514 10.6815 74.8611 187.4774 3.4685 1.9614 16.9801 4.8919 9.5548 13.5440 4.3814 15.6511 10.8704 4.2366 11.7652 7.1070 101.8345 0.1229 25.8602 15.9888 7.4425 17.9342 15.4627 150.0300 285.6053 21.5421 16.8558 21.6268 17.2334 18.5936 19.4742 9.3286 36.1280 64.9021
temp: 298.150 k
press: 1.00000 atm
elementType: 16 8 7 6 6 6 6 1 1 1 1 1 1 1 1 1
symmnumber: 1
zpe: 339627.1 jmol-1
zpe.correction: 0.129357 hartree
zpe.thermalcorrener: 0.138564 hartree
zpe.thermalcorrenthalpy: 0.139508 hartree
zpe.thermalcorrgfe: 0.094316 hartree
zpe.sumelectzpe: -685.300929 hartree
zpe.sumelectthermal: -685.291722 hartree
zpe.sumelectthermalent: -685.290778 hartree
zpe.sumelectthermalfe: -685.335970 hartree
dipole: 3.1893 -1.6144 1.3045
dipole: 3.8052
quadrupole: -55.0315 -45.1869 -51.4642
quadrupole: 6.6182 3.5268 -0.0036
quadrupole: -4.4706 5.3740 -0.9034 6.6182 3.5268 -0.0036
hfenergy: -685.4302859 hartree
pointgroup: C01 [X(C4H9N1O1S1)]
dipole: -1.1460032 -0.9159402 -0.2983295 debye
dipolederiv: -0.2645144 -0.0516076 0.0181935 -0.0311743 -0.2936317 -0.0566258 0.1121081 0.0036491 -0.0586815 -0.9309603 -0.3733551 0.1263565 -0.1126981 -0.8017868 0.0613853 0.042054 0.1014545 -0.3707489 -0.4767817 0.2660242 -0.0407509 0.0692055 -1.0679151 0.0309123 0.0014974 0.0059776 -0.6456884 -0.0460139 0.2131799 -0.096454 0.2483036 0.2740393 -0.0405702 -0.1935361 -0.0585918 0.185196 -0.0292709 -0.0488486 0.0367831 -0.0444751 -0.1139273 -0.0154145 0.0876557 0.0528608 0.018311 1.1324609 0.1272506 -0.1174113 -0.053246 1.3719425 -0.1436305 0.0437864 -0.2006643 0.1789989 0.1214928 -0.0067479 0.0951806 -0.0006004 0.022939 0.0581794 0.0802871 0.0539091 0.0352749 -0.0022365 -0.0227951 -0.0194334 -0.0301287 0.0042806 -0.0281312 -0.0039629 -0.016899 -0.0964335 0.0964541 -0.0072147 -0.0614132 0.0182354 0.0773094 0.0074545 -0.050154 -0.0543976 -0.0954875 0.0695137 -0.0984704 0.0682471 -0.0849576 -0.0093112 0.0633504 0.0547346 0.0579798 0.0459631 -0.1359716 0.111538 -0.0300394 0.0550228 0.0663772 -0.0078488 -0.0379413 -0.0093654 0.0871683 -0.0409689 -0.0886629 0.0425419 -0.09904 0.0553095 0.0569082 0.0355229 0.054855 0.0723839 0.0173062 0.013561 -0.0018483 0.0229375 0.0842954 -0.0517867 -0.0617948 -0.0890827 -0.1289489 -0.0000892 0.0578802 -0.0476286 0.1159267 -0.0799511 0.007141 -0.0870925 0.0046715 0.073299 0.3556826 -0.0854186 0.0005289 -0.0631209 0.2098522 0.0291953 -0.0476369 0.0529782 0.3285133 0.1338972 -0.006313 0.0271474 -0.0101904 0.2001781 0.0294813 0.0244724 0.0406654 0.3708804 unknown
polarizability: 87.9120521|7.6256819|72.8355494|-2.1433359|-5.7154882|50.7695763 unknown
InChI: InChI=1S/C4H9NOS/c1-3(7-2)4(5)6/h3H,5H2,1-2H3
charge 0 multiplicity 1
16 atoms
S  -1.272344 -0.756174 0.620268
O  2.201443 0.860144 -0.673734
N  1.544793 -1.330335 -0.258972
C  -0.2036 0.432014 -0.447394
C  -0.381718 1.896095 -0.019261
C  1.288297 0.011197 -0.44922
C  -2.870979 -0.695033 -0.373645
H  -0.57063 0.287447 -1.482926
H  -0.09442 2.030566 1.036962
H  0.267068 2.543703 -0.634109
H  -1.431468 2.216166 -0.139861
H  -3.592691 -1.335584 0.15671
H  -2.708815 -1.083192 -1.391806
H  -3.25603 0.3359 -0.410268
H  0.784177 -1.976331 -0.035208
H  2.512017 -1.650583 -0.293436
