program: Gaussian 09
title: 000132846
version: EM64L-G09RevD.01
frameworkgroup: C1[X(C20H19F6NO)]
method: RPBEPBE
basis: SDD
operation: Freq
keyword: #p
keyword: freq=noraman
keyword: PBEPBE/SDD
title: #p freq=noraman PBEPBE/SDD
converged: YES YES NO NO
title: Mulliken charges:
elementType: F F F F F F O N C C C C C C C C C C C C C C C C C C C C H H H H H H H H H H H H H H H H H H H
charge: -0.161883 -0.160291 -0.161929 -0.164843 -0.162352 -0.159050 -0.298634 -0.350543 0.035565 -0.250040 -0.461756 -0.339967 -0.426698 0.434999 -0.357188 -0.409063 -0.450439 0.441711 -0.218291 -0.229777 -0.491014 -0.483905 -0.249653 0.326398 0.336571 -0.492472 0.240971 0.245146 0.204138 0.195767 0.223608 0.204990 0.192780 0.226885 0.174289 0.219382 0.270027 0.210353 0.211007 0.281382 0.228752 0.234541 0.223798 0.267929 0.324568 0.229424 0.294807
chargesum: 0.00000
title: Mulliken charges with hydrogens summed into heavy atoms:
elementType: F F F F F F O N C C C C C C C C C C C C C C C C C C C C
charge: -0.161883 -0.160291 -0.161929 -0.164843 -0.162352 -0.159050 -0.298634 -0.080516 0.239703 -0.054273 -0.033157 0.079698 -0.033027 0.434999 0.064171 -0.127681 -0.221687 0.441711 0.016250 -0.005978 -0.223085 -0.159337 -0.020229 0.326398 0.336571 -0.197665 0.240971 0.245146
polarizability: 2.41289842e+02 -1.21213927e+01 2.42104934e+02 8.39780716e+00 1.69328943e+00 1.82064597e+02
1716.lowfreq: -8.2488 -3.9279 -0.0007 0.0003 0.0007 3.2251 4.9472 9.5938 11.3906
frequency: 1.4093 9.3768 11.2810 20.8997 36.5828 48.9906 63.0501 74.8397 93.3902 95.6715 106.8360 127.3498 138.3683 175.2728 190.1339 210.4635 224.8089 246.9463 262.6472 269.9857 286.4636 289.5148 312.0986 319.7784 344.7204 363.5183 389.2078 404.6691 409.6158 431.6745 440.8662 456.7789 472.5682 498.1053 504.5615 536.4680 557.2129 560.8502 597.2342 607.8873 613.8244 624.0155 633.5266 635.5566 648.0884 703.5929 710.4653 733.6077 762.4027 786.6461 806.9729 828.4225 860.4053 862.7510 876.6025 893.3610 899.1741 919.6141 924.9484 927.3975 956.0504 960.0751 983.6349 986.6441 988.9941 990.3637 992.2941 997.3023 1004.5279 1013.7866 1021.5857 1026.6048 1030.6202 1036.3436 1053.1947 1073.5567 1085.2046 1087.0765 1097.7347 1112.1192 1142.9280 1172.3447 1176.9628 1182.0713 1186.1618 1203.7537 1208.2903 1221.1597 1230.0591 1246.4362 1275.0080 1286.7965 1297.4312 1305.7950 1322.6630 1338.2686 1342.0038 1346.1803 1354.5639 1368.6287 1376.5582 1386.9182 1404.3614 1439.4723 1450.0110 1451.6749 1455.6393 1457.5198 1463.2224 1469.5173 1476.3743 1481.0797 1593.2294 1613.4080 1620.1732 1620.8643 2795.9638 2836.6177 2904.6936 2934.9087 2952.5272 2975.8405 3002.7090 3030.4330 3040.3737 3070.3390 3108.1876 3127.9540 3139.9116 3142.5086 3151.9280 3165.7151 3179.9991 3190.8885 3465.3992
redmass: 7.6382 17.4097 18.4352 5.2513 4.9385 6.5025 4.0272 4.9889 3.6853 5.1717 10.3490 5.8461 7.2861 3.2894 4.0042 3.5430 6.9556 4.4151 8.0221 6.4889 5.3545 5.8027 3.0587 7.0591 6.0347 4.6892 4.9406 3.0463 2.9014 5.9565 11.5467 8.0888 2.3458 3.4361 7.1755 3.7106 6.0916 4.7733 4.2112 12.7829 4.6302 2.8516 4.3451 7.3483 6.3277 2.3674 1.9100 2.4756 1.9503 8.9990 3.7011 3.5006 1.9287 1.3130 2.7685 3.4669 1.6460 1.7352 1.4666 1.7167 1.4859 2.4726 1.5900 5.9392 4.3215 5.5140 7.5318 2.8672 1.3958 6.3509 2.1529 2.0631 4.3665 4.5464 2.4935 1.6333 1.7399 3.1006 2.5907 2.0666 3.0359 1.0626 1.2784 1.1919 1.5540 1.1035 1.9270 1.6728 2.4278 1.2698 1.2243 1.2578 1.3725 1.4487 1.3578 1.3897 1.5477 1.7257 2.3722 1.4713 2.1088 5.4462 4.8010 2.0582 1.4155 2.3211 1.3551 2.2934 1.1540 1.1310 1.0951 2.3486 6.1659 6.1921 6.3680 6.1182 1.0796 1.0712 1.0583 1.0826 1.0991 1.0641 1.0627 1.0972 1.0884 1.1033 1.0877 1.0868 1.0912 1.0924 1.0954 1.1007 1.0930 1.0924 1.0753
irintensity: 0.0345 0.0413 0.1151 0.1894 1.0338 0.2680 1.2869 1.0315 3.5002 0.2413 3.3171 0.6078 0.1697 4.6009 2.7974 0.1829 0.5801 0.5456 1.3956 1.3103 1.8883 0.0503 4.1909 0.5434 7.2195 1.6231 6.8171 4.5974 0.4185 0.9229 0.2397 3.1162 34.6185 0.6974 1.7158 21.1017 1.6269 1.0546 17.8509 30.9784 9.9170 17.1347 1.4038 1.3231 9.3718 16.4929 49.8006 40.6142 53.2935 69.4239 15.5247 2.6913 2.1533 2.5315 46.0952 31.2670 81.8536 14.9268 55.8191 16.9071 4.6996 17.5658 0.9239 23.4688 36.1799 2.6054 296.7217 14.0119 2.2063 92.2032 10.1966 10.9298 74.0699 11.0393 6.3926 4.8514 87.6782 170.1380 200.7279 29.8179 37.3156 0.5950 19.8243 4.3934 43.7855 8.8245 0.4791 8.9917 426.6432 1.8454 11.0002 14.9769 28.2284 4.9560 105.0891 13.5379 9.1257 20.7824 39.6629 6.6346 22.9029 0.3139 2.3957 7.2913 19.8944 7.7247 1.0925 17.6409 18.6145 3.3884 9.3667 15.0141 1.2154 3.9977 13.6486 7.5655 64.1327 158.9742 35.6182 47.0459 30.8403 52.3924 26.7884 53.0615 53.9462 44.3340 9.9824 3.2281 15.7565 1.0413 33.5272 16.3282 2.8970 18.8957 0.4792
temp: 298.150 k
press: 1.00000 atm
elementType: 9 9 9 9 9 9 8 7 6 6 6 6 6 6 6 6 6 6 6 6 6 6 6 6 6 6 6 6 1 1 1 1 1 1 1 1 1 1 1 1 1 1 1 1 1 1 1
symmnumber: 1
zpe: 924268.4 jmol-1
zpe.correction: 0.352035 hartree
zpe.thermalcorrener: 0.377596 hartree
zpe.thermalcorrenthalpy: 0.378540 hartree
zpe.thermalcorrgfe: 0.289010 hartree
zpe.sumelectzpe: -1500.495760 hartree
zpe.sumelectthermal: -1500.470199 hartree
zpe.sumelectthermalent: -1500.469255 hartree
zpe.sumelectthermalfe: -1500.558785 hartree
dipole: 5.1983 -3.6071 1.5855
dipole: 6.5228
quadrupole: -169.8847 -157.4656 -160.9958
quadrupole: -9.1086 3.2422 2.6325
quadrupole: -7.1027 5.3164 1.7862 -9.1086 3.2422 2.6325
hfenergy: -1500.8477951 hartree
pointgroup: C01 [X(C20H19F6N1O1)]
dipole: -2.0341035 1.1074406 1.1053091 debye
polarizability: 241.2457644|-8.3074128|234.1394797|-11.0744877|21.1120515|190.0741284 unknown
InChI: InChI=1S/C20H19F6NO/c21-19(22,23)15-9-13(10-16(11-15)20(24,25)26)12-28-17-7-4-8-27-18(17)14-5-2-1-3-6-14/h1-3,5-6,9-11,17-18,27H,4,7-8,12H2
charge 0 multiplicity 1
47 atoms
F  0.665465 -2.494819 -1.952217
F  1.878366 -1.136314 -3.296848
F  2.919794 -2.741374 -2.084801
F  5.040677 2.143213 1.410708
F  5.132468 0.09872 2.375359
F  5.915994 0.38453 0.267909
O  -1.290043 1.189876 0.483263
N  -3.86952 1.40145 -0.990145
C  -2.57151 1.543123 1.123833
C  -3.721536 0.819485 0.358629
C  -2.803163 3.072657 1.1252
C  -2.983725 3.604153 -0.314428
C  -4.139421 2.85382 -1.008202
C  -3.518913 -0.69132 0.291414
C  -0.125377 1.463927 1.310476
C  -2.786012 -1.283658 -0.767887
C  -4.0474 -1.523689 1.30893
C  1.0834 0.782383 0.691273
C  -2.581576 -2.680835 -0.80456
C  -3.839753 -2.921634 1.277958
C  2.381967 1.09372 1.151918
C  0.924674 -0.172217 -0.338142
C  -3.10509 -3.504546 0.219521
C  3.507628 0.445472 0.595617
C  2.058913 -0.807385 -0.890289
C  3.359028 -0.509534 -0.43095
C  1.884299 -1.778714 -2.025101
C  4.872383 0.760555 1.140164
H  -2.56171 1.155009 2.167685
H  -4.627255 1.015092 0.995735
H  -1.970535 3.589994 1.638801
H  -3.717484 3.282131 1.718436
H  -3.193959 4.690001 -0.301034
H  -2.05495 3.436359 -0.889345
H  -5.097179 3.118302 -0.487382
H  -4.231352 3.181367 -2.059551
H  -4.518585 0.857508 -1.571282
H  -0.287532 1.076294 2.34352
H  0.066124 2.556409 1.392947
H  -2.38719 -0.634428 -1.554318
H  -4.631233 -1.078787 2.125601
H  -2.008622 -3.124662 -1.626152
H  -4.256277 -3.553799 2.070492
H  2.524112 1.843684 1.93856
H  -0.085436 -0.403868 -0.682993
H  -2.944479 -4.588186 0.191512
H  4.232923 -1.006266 -0.860737
