program: Gaussian 09
title: 000132814
version: EM64L-G09RevD.01
frameworkgroup: C1[X(C20H28N4O7)]
method: RPBEPBE
basis: SDD
operation: Freq
keyword: #p
keyword: freq=noraman
keyword: PBEPBE/SDD
title: #p freq=noraman PBEPBE/SDD
converged: YES YES NO NO
title: Mulliken charges:
elementType: O O O O O O O N N N N C C C C C C C C C C C C C C C C C C C C H H H H H H H H H H H H H H H H H H H H H H H H H H H H
charge: -0.275805 -0.425876 -0.221668 -0.281489 -0.331420 -0.401373 -0.269423 -0.395740 -0.404962 -0.658451 -0.376807 -0.058371 -0.121004 -0.228779 0.220746 -0.697251 -0.710210 -0.548388 0.124800 -0.549996 0.287523 -0.402893 -0.317859 0.210368 0.374933 -0.357240 -0.391262 0.351111 -0.374068 -0.346156 0.064542 0.247204 0.282833 0.290691 0.401816 0.230263 0.231190 0.207885 0.219570 0.212845 0.242284 0.265199 0.303499 0.358907 0.272246 0.239691 0.219413 0.212814 0.260425 0.211791 0.384932 0.383787 0.250815 0.249013 0.215731 0.285085 0.311567 0.312742 0.208231
chargesum: 0.00000
title: Mulliken charges with hydrogens summed into heavy atoms:
elementType: O O O O O O O N N N N C C C C C C C C C C C C C C C C C C C C
charge: -0.275805 -0.040944 -0.221668 -0.281489 -0.331420 -0.017586 -0.269423 0.006076 -0.046055 -0.034143 -0.168576 0.188833 0.161829 0.061912 0.220746 -0.027913 -0.035511 0.020310 0.124800 -0.038059 0.287523 0.029334 0.154357 0.210368 0.374933 -0.106425 -0.142249 0.351111 -0.158337 -0.061071 0.064542
polarizability: 3.37883156e+02 -5.02972054e+01 2.50896740e+02 1.43220413e+01 7.17785275e+00 2.29388005e+02
1716.lowfreq: -5.1256 -0.0006 -0.0005 0.0007 0.6223 4.3575 7.0777 12.2496 23.0057
frequency: 6.7776 12.2364 22.7508 26.0031 32.4534 36.4800 44.6911 51.3306 54.7300 67.1809 73.5301 76.1502 85.4454 89.1608 99.6937 121.7389 127.9272 142.2950 147.5034 160.2005 172.1495 216.1780 220.5563 224.5362 231.5647 252.6334 261.2359 273.9677 284.7522 286.6535 299.2987 304.4256 325.6583 341.1054 354.4403 395.6868 408.5617 418.1511 424.8589 440.4626 443.6220 448.2180 461.7127 475.0223 485.5206 513.2195 521.7594 544.9297 556.6723 564.4240 591.6876 614.3677 624.7684 629.3710 647.6740 653.5802 664.6679 675.3948 689.7977 696.5333 711.9430 744.4759 749.8643 785.2967 804.8275 809.2880 817.6436 819.0161 831.6210 846.0060 857.5289 864.7534 885.8614 895.7354 923.6524 925.8711 935.6139 944.1707 948.6337 955.7119 962.7857 991.7218 1002.1858 1024.3247 1033.4589 1039.1721 1053.9086 1064.3461 1070.7244 1071.1496 1102.4525 1110.6645 1115.9448 1117.6386 1137.1642 1140.6642 1147.7769 1182.8825 1183.5242 1187.4350 1189.7940 1193.2294 1227.4127 1228.6160 1237.1643 1250.8319 1262.3432 1288.7837 1289.7019 1298.1030 1302.2377 1306.5260 1330.8544 1341.7817 1350.1535 1352.3014 1361.0646 1361.5832 1371.0965 1375.0693 1386.8566 1389.0131 1404.3550 1425.7981 1442.7029 1444.3421 1452.1212 1468.0795 1472.4349 1480.7147 1485.2443 1487.9643 1495.5027 1505.0776 1514.3361 1570.3217 1583.0542 1600.0711 1619.0110 1622.3514 1633.1230 1633.3966 1663.2740 2971.4170 2973.3292 2977.1056 2981.7539 2990.1613 3000.8824 3005.5475 3008.9827 3029.5857 3042.9576 3052.1264 3069.8808 3072.1460 3074.8464 3081.9802 3088.0178 3104.5374 3122.5929 3152.8800 3167.2348 3173.9098 3323.9831 3342.0252 3431.8493 3506.3087 3521.0848 3535.7279 3680.8241
redmass: 5.9166 6.6803 5.5592 4.5825 5.8823 4.5054 7.5381 7.6881 5.3599 4.8233 5.3342 4.8957 3.5283 5.3371 5.5789 5.4695 6.0066 3.8170 4.8487 3.9469 3.6141 3.5347 4.0392 4.4385 1.0901 2.9916 1.1467 4.1655 5.6247 4.7513 5.0969 5.6054 3.7671 3.1830 3.7903 2.5092 1.9311 1.8901 3.8215 1.5564 2.5333 2.2500 2.5567 3.3134 3.1349 2.9061 3.5859 2.7732 3.1243 3.4106 3.3163 1.6872 2.2563 5.4067 2.9321 2.6929 2.3192 1.4706 3.3429 3.4350 3.3076 4.1075 6.5936 2.9008 1.4123 1.6612 1.4177 2.1793 2.3814 2.4926 1.5448 3.9022 3.4899 3.7307 1.3750 3.2417 1.4505 2.1623 2.2656 2.7195 1.5509 1.3856 2.7360 2.4834 1.8819 2.3794 1.8976 1.7223 1.8712 2.1073 3.5057 2.5935 1.8794 1.3307 2.8041 2.1077 2.2147 2.0297 1.3322 1.2732 1.1838 1.2074 1.9958 2.6450 1.3351 1.6603 1.6176 1.4824 1.3336 1.2790 1.2870 1.5928 1.2608 1.4634 1.6813 1.7660 2.4201 1.6701 2.0604 1.6376 1.2120 3.6923 1.2104 3.8619 1.1213 1.0923 1.0953 1.0517 1.0530 1.2314 1.0552 1.0635 1.8645 2.3001 1.7773 6.5115 4.5012 3.2492 6.3804 5.4487 1.5559 5.5350 8.6895 1.0594 1.0681 1.0370 1.0362 1.0602 1.0841 1.0840 1.0626 1.0836 1.0995 1.1020 1.0986 1.1027 1.0997 1.0992 1.0994 1.0919 1.0890 1.0883 1.0935 1.0968 1.0760 1.0821 1.0798 1.0638 1.0642 1.0449 1.1034
irintensity: 0.5524 0.1672 1.0655 5.9526 0.1681 1.2179 0.6217 0.9582 2.7138 3.4382 2.7527 0.3945 4.0606 0.4040 2.8442 8.8061 3.2666 1.4168 0.2141 3.2579 13.3748 12.3902 4.4540 19.3654 0.7964 0.7574 0.0409 3.6253 7.6797 9.7969 9.9157 3.8195 2.4604 9.7049 1.4931 20.1113 50.9838 83.4356 3.7085 61.5181 13.4458 60.5823 6.5595 1.9505 11.5676 8.9628 92.9941 74.0011 5.1018 43.3250 0.9840 76.2931 117.4787 7.7469 14.5671 37.6885 30.5386 122.0137 61.7027 16.1474 54.7407 6.4039 4.5977 25.0541 26.3992 58.5860 76.8588 40.6359 1.2024 50.4330 82.7458 1.3812 9.3527 28.7724 9.1312 95.6553 3.4416 32.7233 14.3070 2.2855 0.7032 7.7297 8.9801 18.7366 7.8524 66.5318 118.9289 23.0357 311.2259 47.1734 18.6124 30.5674 62.1961 16.9384 48.9333 59.8092 4.8782 11.8670 83.3665 6.8164 7.0320 34.8438 25.5257 193.2378 9.6341 12.1415 20.5592 9.4848 29.9425 5.4824 2.5448 10.2414 2.8314 1.2023 17.1198 11.5632 78.8923 16.2779 132.6665 9.7324 26.0969 68.0014 28.4135 38.9205 56.6195 16.5107 38.8731 9.1681 9.3838 169.7770 1.0518 15.1515 282.2695 70.8928 292.0911 44.4560 39.9681 38.5881 284.9998 127.3963 89.0358 237.8427 215.3688 35.3326 57.4130 28.3073 21.6023 19.7556 6.1940 8.8659 27.6988 8.4071 7.8895 31.7940 23.5754 25.9697 24.0521 24.9367 27.5323 5.7492 18.5651 2.1721 11.2981 5.0634 27.7155 183.9774 194.5065 36.1499 28.3846 14.9663 17.9281
temp: 298.150 k
press: 1.00000 atm
elementType: 8 8 8 8 8 8 8 7 7 7 7 6 6 6 6 6 6 6 6 6 6 6 6 6 6 6 6 6 6 6 6 1 1 1 1 1 1 1 1 1 1 1 1 1 1 1 1 1 1 1 1 1 1 1 1 1 1 1 1
symmnumber: 1
zpe: 1238715.2 jmol-1
zpe.correction: 0.471802 hartree
zpe.thermalcorrener: 0.504662 hartree
zpe.thermalcorrenthalpy: 0.505606 hartree
zpe.thermalcorrgfe: 0.401968 hartree
zpe.sumelectzpe: -1522.199867 hartree
zpe.sumelectthermal: -1522.167007 hartree
zpe.sumelectthermalent: -1522.166062 hartree
zpe.sumelectthermalfe: -1522.269701 hartree
dipole: 2.1394 -0.7089 4.0554
dipole: 4.6396
quadrupole: -163.9582 -192.9893 -181.5032
quadrupole: -35.7110 -10.6589 0.8577
quadrupole: 15.5254 -13.5058 -2.0196 -35.7110 -10.6589 0.8577
hfenergy: -1522.6716687 hartree
pointgroup: C01 [X(C20H28N4O7)]
dipole: -1.011139 0.3681859 1.474418 debye
polarizability: 340.8625011|-48.1976668|247.9114086|1.0100889|-13.9458867|229.3939909 unknown
InChI: InChI=1S/C20H28N4O7/c1-11(2)17(20(29)30)24-19(28)14(10-16(26)27)23-15(25)4-3-9-31-13-7-5-12(6-8-13)18(21)22/h5-8,11,14,17,21,23-24,26,29H,3-4,9-10,22H2,1-2H3
charge 0 multiplicity 1
59 atoms
O  -3.198101 -2.201432 -1.499027
O  -0.902101 -2.549013 2.742183
O  -0.189867 -4.588758 1.896647
O  1.370109 2.705412 0.496034
O  -1.970913 0.820266 1.633503
O  -7.186897 0.995412 -1.094186
O  -5.25105 2.045607 -1.805328
N  -2.108322 -1.799979 0.523422
N  -3.098064 0.997925 -0.383888
N  6.715448 -0.968955 1.152848
N  7.2594 0.434538 -0.743208
C  0.036618 -2.574873 -0.56539
C  -1.191971 -2.938164 0.359689
C  -3.887887 -0.229497 -0.149806
C  -3.031236 -1.507994 -0.444531
C  0.997934 -1.571304 0.10867
C  0.772168 -3.839201 -1.059587
C  -5.154738 -0.302251 -1.043206
C  -0.722539 -3.474873 1.704047
C  -1.569149 2.823973 0.231811
C  -2.219677 1.477705 0.56174
C  -0.758182 3.423079 1.399796
C  0.530041 2.657464 1.713404
C  -5.816963 1.019968 -1.341983
C  2.599688 2.035897 0.524109
C  3.105912 1.337223 1.648079
C  3.359694 2.093719 -0.673813
C  5.119954 0.724668 0.361542
C  4.358505 0.690596 1.555899
C  4.601822 1.446989 -0.748835
C  6.446774 0.04424 0.221904
H  -0.434024 -2.086331 -1.441339
H  -1.743837 -3.74916 -0.151559
H  -4.161031 -0.240132 0.9232
H  -1.975605 -1.128478 1.299563
H  0.460114 -0.694864 0.513216
H  1.740994 -1.200273 -0.619596
H  1.556692 -2.044427 0.938672
H  0.085198 -4.518841 -1.596789
H  1.58174 -3.553916 -1.756008
H  1.220113 -4.40293 -0.222466
H  -5.88365 -0.986376 -0.584102
H  -4.845349 -0.767228 -2.002871
H  -3.371684 1.584696 -1.183464
H  -0.897652 2.689999 -0.638586
H  -2.35733 3.534749 -0.084219
H  -0.49956 4.469042 1.15063
H  -1.373791 3.437194 2.318477
H  0.30206 1.607681 1.973594
H  1.073956 3.139674 2.550737
H  -0.553394 -2.931117 3.592278
H  -7.589853 1.869181 -1.35397
H  2.547134 1.296547 2.587082
H  2.955317 2.649521 -1.525469
H  4.750164 0.195551 2.452663
H  5.210707 1.486699 -1.656982
H  7.616436 -1.442079 1.144029
H  5.984203 -1.350781 1.747953
H  8.141523 -0.116687 -0.78771
