program: Gaussian 09
title: 000132787
version: EM64L-G09RevD.01
frameworkgroup: C1[X(C21H24N2O2)]
method: RPBEPBE
basis: SDD
operation: Freq
keyword: #p
keyword: freq=noraman
keyword: PBEPBE/SDD
title: #p freq=noraman PBEPBE/SDD
converged: YES YES NO NO
title: Mulliken charges:
elementType: O O N N C C C C C C C C C C C C C C C C C C C C C H H H H H H H H H H H H H H H H H H H H H H H H
charge: -0.292375 -0.265986 -0.100402 -0.166000 -0.011202 -0.619931 -0.621472 -0.363374 -0.366255 -0.403365 -0.430484 0.291368 0.289880 0.325334 -0.438371 -0.438211 0.090297 -0.234242 -0.234173 -0.383404 0.247039 -0.228588 -0.403060 -0.314460 -0.313126 0.210377 0.234249 0.228601 0.228977 0.233906 0.191322 0.219081 0.223143 0.186217 0.201431 0.252808 0.221895 0.201857 0.240515 0.240640 0.223481 0.223530 0.248394 0.221716 0.248881 0.230908 0.222436 0.224971 0.225224
chargesum: 0.00000
title: Mulliken charges with hydrogens summed into heavy atoms:
elementType: O O N N C C C C C C C C C C C C C C C C C C C C C
charge: -0.292375 -0.265986 -0.100402 -0.166000 0.199175 -0.157081 -0.158589 0.047029 0.043105 0.050874 -0.006731 0.291368 0.289880 0.325334 -0.197856 -0.197570 0.090297 -0.010761 -0.010644 -0.135010 0.247039 -0.006871 -0.154179 0.138884 0.137069
polarizability: 3.57030098e+02 -3.59981492e+00 2.46177658e+02 -2.89038982e+00 -6.96943594e+00 1.43104282e+02
1716.lowfreq: -8.3620 -3.6540 -0.0004 0.0003 0.0006 9.2137 17.9010 31.1862 47.4604
frequency: 17.8086 31.0537 47.3598 54.4642 89.5711 97.6118 108.0154 124.8484 162.3791 173.7613 194.3679 230.6465 239.1884 255.0262 272.9003 297.2464 313.8790 330.3188 348.4221 356.7345 393.0221 417.3541 431.5962 461.7530 469.5484 477.3189 486.5293 500.1155 506.5207 531.0665 537.0922 569.3479 583.1641 592.4366 626.0933 634.8275 666.0613 710.5948 712.8768 751.0380 757.3943 763.1863 770.2483 813.5876 829.3480 842.6359 848.6397 856.4180 867.1584 868.8472 881.6637 893.6166 903.0764 936.4516 942.8919 955.6886 981.3744 984.2795 1016.8038 1021.0521 1021.4668 1030.9774 1049.6382 1052.9893 1067.1238 1075.5581 1087.0380 1090.9014 1102.2485 1105.3991 1133.5442 1141.9962 1148.6295 1153.4170 1168.7312 1177.1223 1185.7630 1191.7533 1200.2524 1203.3473 1208.0591 1220.5014 1226.1587 1239.2249 1250.8806 1257.7007 1264.5445 1281.3893 1295.2213 1297.0770 1309.7034 1339.3374 1347.4310 1350.5630 1352.3134 1353.5231 1366.0598 1381.4918 1388.8012 1390.2712 1392.0883 1440.4929 1446.1200 1455.0488 1455.5530 1457.4905 1458.1062 1459.2068 1460.2540 1463.3816 1471.5461 1479.5162 1486.7538 1586.6247 1597.5432 1602.7728 1620.1143 2824.9625 2851.3982 2866.2945 2900.9753 2915.8037 2968.6008 2971.3616 2992.7750 3002.0505 3045.5998 3048.7259 3050.1313 3052.5809 3055.3243 3093.2609 3097.1431 3103.3531 3117.3377 3124.2298 3138.1715 3138.2519 3157.9229 3166.1512 3177.5229
redmass: 5.2639 3.8272 5.0637 4.7056 3.1587 4.6104 3.6946 4.2392 4.1373 5.9294 2.4400 3.8004 3.2701 2.8895 2.5887 2.8095 2.4732 3.0268 4.3479 5.0947 1.9625 2.5748 5.4160 3.2367 5.0755 3.0678 2.3047 3.2994 3.2704 4.7233 4.7789 4.4157 6.0565 4.9951 3.1776 3.7388 2.4479 2.4731 3.2282 1.4042 2.7580 2.4818 2.8653 4.1482 4.2796 2.3450 1.8616 1.6216 1.3308 3.1034 2.8285 3.0030 1.5089 1.3831 1.3109 2.3197 2.9269 1.3148 2.3346 3.2178 2.4084 1.9759 2.2960 2.4184 2.5674 2.0074 1.9879 2.5335 2.1914 2.3105 1.2267 2.6788 3.1706 2.4498 1.0663 2.5013 1.4226 2.3139 1.3279 1.2371 1.2428 1.6104 1.4074 1.5334 1.3913 1.4865 2.0869 1.3251 1.3053 1.4251 1.4000 1.6095 1.3043 1.3309 1.3673 1.3472 1.8082 1.8211 3.1676 4.8313 1.6282 2.4824 2.1474 1.1225 1.1482 1.0971 1.1172 1.1911 1.1506 1.1587 1.1245 2.2281 3.0056 6.9554 6.7666 7.3064 7.2042 1.0810 1.0712 1.0700 1.0689 1.0712 1.0636 1.0641 1.0674 1.0608 1.0953 1.0947 1.0938 1.0883 1.0898 1.0995 1.1035 1.0897 1.0852 1.0895 1.0945 1.0867 1.1003 1.0913 1.0979
irintensity: 0.0127 0.2425 0.1292 0.0320 2.6699 0.2627 8.2761 3.3944 0.1733 1.1802 0.0339 0.5571 3.4115 7.5691 3.1573 6.8692 9.4678 2.7765 0.6373 2.4901 0.3156 5.8377 2.9763 0.8301 3.0915 2.1648 8.4035 7.3534 1.0828 3.0111 0.4505 0.4864 0.6832 0.3815 2.0568 0.6880 8.6962 24.6631 0.2176 65.8198 13.3317 41.7543 24.8945 8.6978 5.4750 0.9792 0.7625 0.2354 0.2487 26.8830 8.1273 4.0012 0.8102 0.2984 1.3253 24.1814 112.8103 0.0644 34.5267 20.7404 12.9423 17.6925 22.2792 20.1820 4.7564 28.8313 1.0863 53.2591 0.3167 13.8023 0.9804 64.0671 31.1828 42.6190 0.0815 0.4184 14.2223 24.1177 0.1287 31.6029 21.1356 1.3367 24.5098 8.0001 61.4227 93.6839 25.4641 35.0325 18.7114 9.2209 1.6796 44.0210 2.1105 19.6443 2.5196 5.1257 16.3969 49.5746 7.6346 5.1370 1.8330 78.1745 1.0991 11.4243 8.2434 2.6728 16.4004 1.7228 25.0436 77.6500 1.0227 20.4537 107.4433 13.9959 2.8948 199.1325 0.3074 50.7968 60.3641 88.9849 68.6477 117.5159 24.1969 25.9435 57.4109 49.5125 1.8002 67.7430 1.8855 69.7619 8.7868 37.2446 21.6064 4.9796 3.6967 3.6003 35.8056 14.6518 41.0687 12.9096 9.7614
temp: 298.150 k
press: 1.00000 atm
elementType: 8 8 7 7 6 6 6 6 6 6 6 6 6 6 6 6 6 6 6 6 6 6 6 6 6 1 1 1 1 1 1 1 1 1 1 1 1 1 1 1 1 1 1 1 1 1 1 1 1
symmnumber: 1
zpe: 1072087.4 jmol-1
zpe.correction: 0.408337 hartree
zpe.thermalcorrener: 0.429104 hartree
zpe.thermalcorrenthalpy: 0.430048 hartree
zpe.thermalcorrgfe: 0.357971 hartree
zpe.sumelectzpe: -1072.716351 hartree
zpe.sumelectthermal: -1072.695584 hartree
zpe.sumelectthermalent: -1072.694639 hartree
zpe.sumelectthermalfe: -1072.766717 hartree
dipole: -0.3693 1.8615 0.6618
dipole: 2.0099
quadrupole: -153.5801 -128.4267 -151.2072
quadrupole: 11.4258 0.1646 -1.7837
quadrupole: -9.1754 15.9780 -6.8025 11.4258 0.1646 -1.7837
hfenergy: -1073.1246879 hartree
pointgroup: C01 [X(C21H24N2O2)]
dipole: -0.1560587 0.7436568 0.2188779 debye
polarizability: 357.1130137|-2.122203|244.9832464|-2.6270779|-12.7483587|144.2157788 unknown
InChI: InChI=1S/C21H24N2O2/c1-2-5-17-15-18(14-16(17)4-1)22-8-10-23(11-9-22)19-6-3-7-20-21(19)25-13-12-24-20/h1-7,18H,8-15H2
charge 0 multiplicity 1
49 atoms
O  3.35237 1.576135 0.256746
O  6.223463 1.113769 0.042368
N  -1.326588 -0.326861 -0.111031
N  1.569689 -0.603414 -0.005251
C  -2.677926 0.052979 0.37393
C  -3.415688 1.042381 -0.584809
C  -3.651201 -1.16448 0.49154
C  -0.430192 0.850288 -0.270762
C  -0.667917 -1.318822 0.777399
C  0.925234 0.429364 -0.8564
C  0.688095 -1.768086 0.204909
C  -4.88543 0.731127 -0.344446
C  -5.020828 -0.538815 0.276005
C  2.967033 -0.818131 -0.102546
C  -6.024084 1.495761 -0.665125
C  -6.295774 -1.054095 0.580969
C  3.884929 0.275618 0.018806
C  -7.308475 0.980603 -0.357053
C  -7.443329 -0.285344 0.261763
C  3.520993 -2.121905 -0.25732
C  5.283652 0.055053 -0.057154
C  4.917719 -2.329952 -0.286177
C  5.811119 -1.246227 -0.198112
C  4.355488 2.52554 0.779112
C  5.62231 2.454743 -0.076288
H  -2.616447 0.538622 1.38442
H  -3.131034 0.805489 -1.63101
H  -3.164163 2.101408 -0.397634
H  -3.568436 -1.697836 1.455089
H  -3.41969 -1.886957 -0.318491
H  -0.257329 1.364808 0.708686
H  -0.901771 1.571857 -0.960241
H  -1.316285 -2.207184 0.873064
H  -0.50194 -0.898811 1.802882
H  0.761866 0.023961 -1.881769
H  1.584506 1.306699 -0.921182
H  1.162854 -2.455853 0.926805
H  0.510882 -2.324505 -0.745957
H  -5.923534 2.478044 -1.141898
H  -6.404435 -2.033103 1.062659
H  -8.203493 1.566939 -0.594794
H  -8.441805 -0.670255 0.498862
H  2.853298 -2.979017 -0.376759
H  5.308826 -3.346219 -0.402911
H  6.896007 -1.375156 -0.242053
H  4.587292 2.271542 1.831841
H  3.878195 3.517403 0.728084
H  5.379701 2.659732 -1.137598
H  6.394475 3.159264 0.273133
