program: Gaussian 09
title: 000132767
version: EM64L-G09RevD.01
frameworkgroup: C1[X(C14H14N2O)]
method: RPBEPBE
basis: SDD
operation: Freq
keyword: #p
keyword: freq=noraman
keyword: PBEPBE/SDD
title: #p freq=noraman PBEPBE/SDD
converged: YES YES NO NO
title: Mulliken charges:
elementType: O N N C C C C C C C C C C C C C C H H H H H H H H H H H H H H
charge: -0.310429 -0.245516 -0.264890 0.343056 0.199700 -0.447251 -0.511520 -0.326172 0.427678 0.092171 0.031565 -0.351786 -0.429068 -0.337030 -0.696098 -0.232606 -0.249341 0.216211 0.216389 0.244528 0.279528 0.352593 0.200395 0.201767 0.228553 0.267866 0.211247 0.211351 0.223196 0.224894 0.229021
chargesum: 0.00000
title: Mulliken charges with hydrogens summed into heavy atoms:
elementType: O N N C C C C C C C C C C C C C C
charge: -0.310429 -0.245516 0.087704 0.343056 0.199700 -0.014652 -0.266992 -0.046643 0.427678 0.092171 0.031565 0.050376 -0.200516 -0.069164 -0.050304 -0.007712 -0.020320
polarizability: 2.73239112e+02 -2.41281418e+01 1.93193811e+02 -5.32516574e-02 2.59660921e-03 7.94319201e+01
1716.lowfreq: -15.5441 -0.0004 0.0006 0.0006 3.0934 6.2236 35.0509 52.3516 79.6523
frequency: 34.9450 51.2527 79.6481 93.4062 116.5509 150.0132 222.5683 227.0423 244.8487 260.9687 269.4763 279.5742 329.5844 346.6658 413.7250 416.4044 441.4654 483.5698 536.9703 562.7469 568.8234 637.5242 662.3884 665.5373 687.4914 693.0392 738.7179 753.0275 781.4745 803.5011 807.1684 816.7393 862.0891 878.2144 882.0620 895.8079 919.0014 972.7370 994.3255 1009.1116 1025.7919 1055.7847 1074.6270 1103.1141 1104.5423 1111.6261 1168.5645 1184.6559 1198.6857 1222.5424 1233.8511 1256.3454 1267.6214 1286.2391 1286.7679 1303.4841 1341.0087 1367.7375 1379.5930 1389.4707 1395.7719 1431.1700 1450.7194 1464.0488 1473.9168 1477.9204 1478.3569 1485.8524 1536.8839 1562.6584 1577.2119 1619.8964 1624.0545 2951.4537 2971.5436 2975.2873 2987.8497 3025.9460 3071.4823 3076.8537 3120.2509 3136.7117 3148.6418 3166.0657 3175.3464 3246.9890 3586.5734
redmass: 3.2351 1.6882 3.9178 4.3981 4.3946 5.4040 3.8003 1.1031 3.4765 4.9488 4.5023 6.6781 4.1905 3.5102 6.9330 1.5091 2.9559 7.4158 3.0741 2.7706 7.8668 5.6363 3.6024 6.3217 3.6835 4.1368 1.1491 1.4471 2.8902 1.4710 5.6534 1.3285 4.8580 1.2887 1.5529 2.1238 5.6841 1.3709 1.3238 3.5287 2.1435 2.5650 1.6543 2.1188 1.4892 2.1045 1.1509 2.0225 1.7847 2.1029 1.2954 2.0618 2.2468 1.0869 1.7085 2.9895 1.9655 2.3565 2.3403 1.3065 7.1975 2.4065 2.9849 1.1116 1.0570 1.0422 3.2158 1.0933 6.5147 10.7751 5.6642 6.3956 8.7471 1.0593 1.0586 1.0362 1.0985 1.1027 1.1008 1.0993 1.0860 1.0891 1.0943 1.1002 1.0923 1.0988 1.0820
irintensity: 0.0440 0.0831 0.0678 5.5886 0.2502 0.2989 0.5634 0.0503 3.3514 1.1290 0.7942 8.7073 15.7065 4.1665 2.6721 87.7448 22.3183 4.4303 20.5521 0.5185 0.2642 0.7469 24.0708 3.1365 3.1558 1.1506 0.3034 23.4622 7.2984 33.3916 2.3719 84.1825 1.7483 0.5918 4.3467 11.8177 8.3497 2.9928 0.1099 7.2909 6.4785 0.5449 28.7080 21.8688 0.3465 21.2793 3.6702 47.2489 8.8172 27.7797 0.0946 2.8318 10.5859 0.4955 3.5246 32.1526 0.9320 13.7398 2.5706 10.8292 28.7388 70.1877 0.1753 4.4290 4.8528 13.4419 24.7951 9.2028 37.9664 358.8509 30.5600 14.5624 220.4859 11.9861 42.6932 35.1948 5.0954 25.5720 67.3437 45.6236 2.7821 13.4816 17.4493 34.0068 3.2957 0.6000 172.0112
temp: 298.150 k
press: 1.00000 atm
elementType: 8 7 7 6 6 6 6 6 6 6 6 6 6 6 6 6 6 1 1 1 1 1 1 1 1 1 1 1 1 1 1
symmnumber: 1
zpe: 652991.9 jmol-1
zpe.correction: 0.248711 hartree
zpe.thermalcorrener: 0.263370 hartree
zpe.thermalcorrenthalpy: 0.264314 hartree
zpe.thermalcorrgfe: 0.206498 hartree
zpe.sumelectzpe: -725.414933 hartree
zpe.sumelectthermal: -725.400274 hartree
zpe.sumelectthermalent: -725.399330 hartree
zpe.sumelectthermalfe: -725.457146 hartree
dipole: -4.4487 -1.5199 0.0028
dipole: 4.7012
quadrupole: -88.0646 -95.5487 -104.9152
quadrupole: -11.4900 -0.0108 0.0064
quadrupole: 8.1116 0.6275 -8.7390 -11.4900 -0.0108 0.0064
hfenergy: -725.663644 hartree
pointgroup: C01 [X(C14H14N2O1)]
dipole: 1.7331055 -0.6459929 -0.0061872 debye
polarizability: 274.506847|21.8719137|191.8909873|0.946289|1.9382358|79.4670095 unknown
InChI: InChI=1S/C14H14N2O/c1-2-5-11-9-15-16-13(11)8-10-6-3-4-7-12(10)14(16)17/h3-4,6-9,15H,2,5H2,1H3
charge 0 multiplicity 1
31 atoms
O  -1.539758 2.741642 0.064679
N  0.16475 1.169454 0.04456
N  1.155749 2.14441 0.064061
C  0.762939 -0.106062 0.025003
C  2.200689 0.120019 0.032678
C  3.244221 -0.968817 0.014065
C  -0.076823 -1.22217 0.004081
C  2.385107 1.502341 0.056363
C  -1.498382 -1.01909 0.003279
C  -2.065541 0.318439 0.023344
C  -1.212213 1.504523 0.045462
C  4.7034 -0.460753 0.044371
C  -2.413427 -2.126252 -0.017434
C  -3.479748 0.500189 0.021814
C  5.724779 -1.616649 0.013068
C  -3.796376 -1.924212 -0.018368
C  -4.340714 -0.602052 0.001279
H  3.080677 -1.64696 0.877839
H  3.10074 -1.597089 -0.890158
H  0.347239 -2.228395 -0.011658
H  3.304811 2.080864 0.068914
H  0.855971 3.119483 0.079008
H  4.877182 0.209331 -0.821701
H  4.861243 0.149218 0.956531
H  -2.005082 -3.143949 -0.032666
H  -3.861142 1.52684 0.03723
H  5.607416 -2.225385 -0.903063
H  5.592412 -2.288311 0.882027
H  6.762325 -1.237209 0.035252
H  -4.472566 -2.786761 -0.034352
H  -5.426176 -0.457437 0.000194
