program: Gaussian 09
title: 000132749
version: EM64L-G09RevD.01
frameworkgroup: C1[X(C22H19ClN4O3)]
method: RPBEPBE
basis: SDD
operation: Freq
keyword: #p
keyword: freq=noraman
keyword: PBEPBE/SDD
title: #p freq=noraman PBEPBE/SDD
converged: YES YES NO NO
title: Mulliken charges:
elementType: Cl O O O N N N N C C C C C C C C C C C C C C C C C C C C C C H H H H H H H H H H H H H H H H H H H
charge: -0.055492 -0.311755 -0.317213 -0.314173 -0.252390 -0.365472 -0.311733 -0.005250 -0.659067 0.368817 0.391509 0.202497 0.187995 0.275661 -0.384906 -0.259788 -0.358348 -0.352171 -0.262674 -0.547250 -0.524983 -0.132436 -0.212081 -0.231385 0.506494 0.275203 -0.354127 -0.343433 -0.327789 -0.330972 0.278771 0.271242 0.246417 0.302647 0.262757 0.265032 0.220692 0.256389 0.227278 0.253059 0.240020 0.237854 0.375931 0.261265 0.354641 0.234985 0.238550 0.239714 0.239470
chargesum: 0.00000
title: Mulliken charges with hydrogens summed into heavy atoms:
elementType: Cl O O O N N N N C C C C C C C C C C C C C C C C C C C C C C
charge: -0.055492 -0.311755 -0.317213 -0.314173 -0.252390 0.010459 0.042908 -0.005250 -0.109054 0.368817 0.391509 0.202497 0.187995 0.275661 -0.138490 0.042859 -0.095591 -0.087139 -0.022654 -0.070169 -0.044646 -0.132436 0.025773 0.029880 0.506494 0.275203 -0.119143 -0.104883 -0.088075 -0.091503
polarizability: 3.86175538e+02 3.35575275e+01 3.42685624e+02 1.16687314e+01 -1.97045856e+01 1.65897563e+02
1716.lowfreq: -4.9941 -0.0014 -0.0012 -0.0009 1.0609 3.8046 10.7170 14.3361 21.1046
frequency: 9.3645 14.2873 21.0794 28.9870 29.2564 41.0334 47.6176 69.6563 85.1487 88.8314 91.4276 104.2918 131.4025 151.4506 167.3525 188.5595 235.8012 241.2543 254.3888 283.1892 294.0640 298.7040 315.7461 321.0461 338.7787 342.7012 362.5009 368.6075 415.0920 429.7905 440.8014 452.7500 472.2276 503.6401 515.6632 524.7615 546.9663 553.4396 568.2645 575.9882 603.7465 620.0184 632.8262 637.1097 663.4056 671.5146 689.9061 697.8181 708.0286 716.5233 746.2397 753.1219 769.5237 781.1848 788.6120 808.5509 811.8339 822.5315 850.5456 866.6527 871.8938 882.9823 887.6047 919.3685 943.6698 949.5669 960.8077 964.2950 976.4518 980.8244 987.1438 988.6804 1003.0270 1021.9675 1035.9372 1061.9142 1075.2417 1081.6028 1088.6274 1107.4663 1112.9911 1133.1238 1160.4849 1168.6653 1172.4617 1192.4157 1202.6225 1216.7265 1223.5791 1228.2390 1243.4642 1254.6655 1262.7427 1271.1736 1282.2120 1290.9589 1311.9875 1333.0301 1339.5901 1343.8303 1350.1531 1376.7838 1387.3848 1404.5741 1404.6924 1421.7274 1442.3426 1449.0190 1467.1851 1472.9670 1476.2111 1486.0710 1487.2142 1528.7668 1557.7423 1561.1103 1572.0942 1588.6114 1590.9947 1598.3795 1607.9887 1616.7932 2990.5053 3007.6794 3010.4980 3045.5033 3072.3519 3074.9493 3112.3809 3123.5984 3124.1255 3144.3014 3144.3387 3151.1604 3164.0027 3164.5101 3177.3755 3183.9558 3199.7906 3478.3521 3501.1709
redmass: 4.8559 4.8128 7.5793 7.2298 5.7751 3.7657 6.5789 6.1316 6.9602 4.9674 6.0033 7.8962 8.0279 5.1737 6.4167 6.0751 6.1663 7.9112 7.8916 4.9864 7.3626 5.3460 5.1333 7.0412 2.9701 5.0969 3.2811 2.4853 4.2130 4.2219 3.4130 3.5352 3.4667 2.8138 3.4964 1.8013 4.3340 5.2738 1.7793 3.5962 4.9711 2.7164 6.5636 4.8917 6.9153 5.4567 6.3558 3.9711 5.2259 4.1698 4.5311 3.5937 1.3018 1.7386 2.7235 1.8115 1.4004 3.6255 2.8300 1.5003 1.7193 3.5819 1.2485 3.0473 1.3304 1.4807 6.1114 1.4588 1.4927 2.6642 1.3300 2.0451 2.6513 4.3442 2.1687 2.1770 2.6705 1.7072 2.7065 2.2918 2.1437 1.3999 1.8559 1.6677 1.1863 1.9684 1.4356 1.4253 2.3916 1.9918 3.2151 1.6986 1.5007 1.3609 1.5242 1.6063 4.1285 1.4813 1.3460 1.5669 1.7944 6.4149 6.6130 2.4154 2.9852 3.0056 2.4287 1.1424 2.0163 2.6681 2.5256 1.1057 1.2394 2.3324 6.8634 7.7322 8.2892 5.7462 6.7098 7.1303 7.5180 7.1851 1.0595 1.0598 1.0621 1.1009 1.1029 1.1042 1.0902 1.0863 1.0888 1.0878 1.0961 1.0995 1.0890 1.0932 1.0998 1.0976 1.0932 1.0792 1.0799
irintensity: 0.0696 0.1648 0.4529 0.4718 0.5282 0.2729 0.9592 0.8749 6.9346 3.6279 3.2777 3.1145 1.7399 10.9565 19.1754 1.8147 6.4154 15.6256 4.4438 7.2656 0.2520 1.9111 0.2651 1.5924 0.8896 2.9825 2.4421 0.0050 25.0002 30.5487 22.8625 11.6896 3.5222 3.7689 12.3821 97.6655 16.9466 1.5556 40.2906 24.9185 3.9101 9.1280 3.1639 14.6795 0.5371 3.5676 39.7918 10.2963 7.3806 3.1182 8.4735 5.1361 90.6335 4.6162 12.3278 30.7948 47.7485 37.4987 6.3817 24.7889 4.7951 9.9912 0.0178 52.1157 0.6625 5.7758 2.1601 1.2218 0.0071 2.2223 0.0895 10.7406 10.5741 1.0252 3.5041 4.3997 8.9834 2.0504 56.1731 41.8311 11.5838 30.0760 0.9727 7.4422 1.2135 119.4689 62.2666 1.1160 7.2232 4.1637 274.6809 22.0803 3.2025 32.2500 7.6413 24.5375 7.2328 19.7644 2.4159 11.7627 7.6293 26.8046 0.1951 4.1903 62.3099 1023.5736 146.3759 31.4373 12.5429 68.6136 486.7260 18.9738 28.1814 71.9333 53.3917 276.0821 21.3011 53.6604 23.4818 61.0975 23.3644 36.8063 5.7290 20.6053 17.8347 3.7150 6.8425 18.6921 7.5009 2.9367 15.5127 5.9125 55.7864 0.6315 4.1163 8.4942 11.2687 1.6228 4.0684 38.1102 139.3800
temp: 298.150 k
press: 1.00000 atm
elementType: 17 8 8 8 7 7 7 7 6 6 6 6 6 6 6 6 6 6 6 6 6 6 6 6 6 6 6 6 6 6 1 1 1 1 1 1 1 1 1 1 1 1 1 1 1 1 1 1 1
symmnumber: 1
zpe: 973873.9 jmol-1
zpe.correction: 0.370929 hartree
zpe.thermalcorrener: 0.397269 hartree
zpe.thermalcorrenthalpy: 0.398213 hartree
zpe.thermalcorrgfe: 0.308821 hartree
zpe.sumelectzpe: -1752.350132 hartree
zpe.sumelectthermal: -1752.323792 hartree
zpe.sumelectthermalent: -1752.322848 hartree
zpe.sumelectthermalfe: -1752.412240 hartree
dipole: -2.2341 3.5038 1.3022
dipole: 4.3548
quadrupole: -211.8707 -181.3710 -178.6456
quadrupole: -8.8751 6.5716 -10.1116
quadrupole: -21.2416 9.2581 11.9835 -8.8751 6.5716 -10.1116
hfenergy: -1752.7210607 hartree
pointgroup: C01 [X(C22H19Cl1N4O3)]
dipole: 1.1151887 1.1731877 -0.5615873 debye
polarizability: 372.662616|-38.5770219|357.4170534|14.2151808|11.48862|164.6790547 unknown
InChI: InChI=1S/C22H19ClN4O3/c23-17-6-7-20-18(13-17)27(14-16-3-1-2-4-19(16)30-20)22(29)26-25-21(28)8-5-15-9-11-24-12-10-15/h1-4,6-7,9-13,25-26H,5,8,14H2
charge 0 multiplicity 1
49 atoms
Cl 4.425872 -5.486177 0.326817
O  4.726546 0.540685 0.304985
O  0.543771 -2.20811 0.427404
O  -1.971449 1.729617 -0.615648
N  2.175536 -0.829036 -0.616727
N  -0.064976 -0.13982 -0.40925
N  -1.388296 -0.415684 -0.028195
N  -8.841859 0.242919 0.913744
C  2.430327 0.322914 -1.526814
C  2.717345 1.594322 -0.754999
C  3.323825 -1.550998 -0.157446
C  3.808861 1.606867 0.14893
C  4.515988 -0.858929 0.214523
C  0.883316 -1.127639 -0.155232
C  1.926463 2.760757 -0.878623
C  3.314907 -2.97038 -0.11734
C  4.126589 2.764541 0.890558
C  5.671316 -1.59124 0.575592
C  2.225318 3.924018 -0.134061
C  -4.790952 0.746021 -0.701641
C  -3.727214 0.257247 0.324644
C  4.467832 -3.664685 0.273606
C  3.331046 3.921669 0.747588
C  5.661938 -2.997128 0.611478
C  -6.201622 0.580127 -0.165187
C  -2.317698 0.592359 -0.145806
C  -6.994767 -0.549622 -0.488008
C  -6.771383 1.537944 0.713105
C  -8.289494 -0.675418 0.065649
C  -8.073564 1.332265 1.219962
H  3.295045 0.043726 -2.155751
H  1.567132 0.447681 -2.202585
H  1.078311 2.76554 -1.576531
H  2.39551 -3.497416 -0.3765
H  4.987217 2.73955 1.565189
H  6.56742 -1.028188 0.850541
H  -4.668452 0.181735 -1.644422
H  -4.574624 1.806455 -0.924437
H  -3.840468 -0.826517 0.514791
H  -3.897679 0.775846 1.288125
H  1.601666 4.816948 -0.239199
H  3.573662 4.817537 1.328668
H  0.09717 0.858773 -0.579741
H  6.554826 -3.554959 0.904868
H  -1.510779 -1.341357 0.397146
H  -6.615087 -1.321762 -1.167155
H  -6.213484 2.439619 0.991782
H  -8.919348 -1.540025 -0.173896
H  -8.533459 2.062308 1.895999
