program: Gaussian 09
title: 000132698
version: EM64L-G09RevD.01
frameworkgroup: C1[X(C18H18O2)]
method: RPBEPBE
basis: SDD
operation: Freq
keyword: #pfreq=noraman
keyword: PBEPBE/SDD
title: #p freq=noraman PBEPBE/SDD
converged: YES YES NO NO
title: Mulliken charges:
elementType: O O C C C C C C C C C C C C C C C C C C H H H H H H H H H H H H H H H H H H
charge: -0.464256 -0.161726 -0.121460 0.217298 0.235248 0.235637 0.149474 0.142242 0.142711 -0.731911 -0.731748 -0.703463 -0.380452 -0.380563 -0.405887 -0.405953 -0.243685 -0.243227 -0.227640 -0.227825 0.269064 0.209795 0.211609 0.269178 0.209714 0.211416 0.227448 0.227790 0.201711 0.257859 0.257551 0.355132 0.242816 0.242793 0.228751 0.228703 0.227921 0.227936
chargesum: 0.00000
title: Mulliken charges with hydrogens summed into heavy atoms:
elementType: O O C C C C C C C C C C C C C C C C C C
charge: -0.109124 -0.161726 -0.121460 0.217298 0.235248 0.235637 0.149474 0.142242 0.142711 -0.041442 -0.041440 -0.046514 -0.122592 -0.123012 -0.163071 -0.163161 -0.014935 -0.014524 0.000281 0.000111
polarizability: 2.23863873e+02 6.87187767e-02 2.52191079e+02 -1.91126396e+01 2.65417831e-02 1.22005560e+02
1716.lowfreq: -9.0271 -0.0008 -0.0007 0.0006 4.1314 7.4568 27.8531 54.5073 60.6735
frequency: 27.4153 54.4965 60.6301 97.0057 98.2379 150.4233 168.6906 178.4475 203.8551 216.5673 232.0363 244.2829 250.4109 266.1904 291.5059 309.9294 324.0988 342.8263 350.6922 376.2499 403.6489 422.0441 442.3884 474.6813 480.1968 508.3231 566.9300 571.6533 599.8179 600.0131 618.5275 671.8824 713.3812 723.8230 750.2446 763.9301 764.1011 797.7046 799.1322 855.4426 884.6413 886.8713 893.7347 934.1559 936.3926 951.4653 953.3427 957.6997 988.2292 988.9633 991.3608 995.8541 1014.2325 1021.5262 1022.3955 1033.6351 1051.9895 1101.1154 1105.0339 1165.2847 1168.9876 1180.4739 1181.3131 1197.9124 1220.1102 1237.1810 1246.0292 1285.2489 1290.9416 1302.7903 1366.1826 1372.7555 1376.5981 1401.3617 1406.7470 1437.3329 1443.3359 1452.7543 1463.6276 1464.3999 1470.5317 1478.4548 1484.2194 1484.2639 1507.2338 1594.1167 1595.5923 1597.0541 1615.2469 1617.3042 2976.7659 2977.9364 2988.5105 3062.8897 3066.4582 3086.3485 3097.3360 3111.2220 3113.5609 3126.1476 3127.1487 3136.4413 3137.8596 3148.4373 3149.3433 3164.1951 3164.8944 3551.1350
redmass: 4.8636 4.2957 3.1170 4.7311 6.0114 3.9081 4.1515 1.0577 2.7886 3.5093 1.9669 1.3823 2.7946 1.4472 3.2827 2.1358 1.5815 3.0587 3.7774 2.2617 5.2663 3.3495 3.6692 3.3786 4.3624 5.3652 3.3638 4.0197 6.4212 6.0311 6.8541 5.0290 5.0937 5.1941 2.1059 2.1390 1.6259 3.1742 2.5509 2.5026 1.4770 1.6435 5.5051 1.7262 1.6180 1.4380 1.4167 1.2087 1.3352 1.6980 1.9207 6.4063 3.2516 2.1453 1.5469 1.8747 2.0893 2.1204 1.8235 1.4415 1.3472 1.8964 1.5707 2.7393 2.7421 1.9441 2.3606 1.4841 1.7507 1.8831 1.1755 9.4695 1.1840 1.2069 3.3453 2.2137 2.8268 1.0484 2.4508 1.0513 1.0581 1.0938 1.7944 1.4930 1.0638 10.9603 7.2877 6.5946 7.3945 7.1719 1.0360 1.0364 1.0361 1.0999 1.0988 1.0994 1.0997 1.0990 1.0984 1.0854 1.0853 1.0894 1.0896 1.0947 1.0948 1.1003 1.1003 1.0661
irintensity: 1.2406 0.6913 0.6798 2.6256 0.6485 0.1424 0.2620 0.0004 2.5691 0.1590 0.0163 0.6753 0.0699 3.5132 6.5798 24.7549 80.6104 0.5522 5.2638 0.1476 1.2341 6.3979 2.1047 0.2489 1.1829 1.3141 0.1343 7.3955 3.4004 5.8414 7.9168 13.8212 0.1933 0.3274 95.6750 87.0328 2.1349 0.5002 0.0269 12.0811 4.6763 0.1718 11.9629 1.6204 8.9979 6.0699 0.0422 0.6173 0.0738 54.6351 78.4849 3.5749 11.9146 3.7628 0.3936 4.4278 108.5138 11.6519 2.0843 0.7929 2.8124 3.8389 0.1291 5.6735 3.2024 3.7116 16.5498 5.6312 38.8118 8.1762 20.5619 4.0461 19.4581 30.9224 2.5656 33.2113 12.4242 0.5637 6.5576 0.9305 8.9171 14.6991 1.7679 1.5428 40.2718 69.6685 0.3545 1.1556 7.3869 0.3587 40.2527 18.5003 38.3512 10.7029 45.2977 41.8155 25.4560 0.6171 15.4278 3.2396 0.1399 7.9752 0.5190 1.2523 46.4735 58.5007 6.6373 10.9869
temp: 298.150 k
press: 1.00000 atm
elementType: 8 8 6 6 6 6 6 6 6 6 6 6 6 6 6 6 6 6 6 6 1 1 1 1 1 1 1 1 1 1 1 1 1 1 1 1 1 1
symmnumber: 1
zpe: 806142.6 jmol-1
zpe.correction: 0.307043 hartree
zpe.thermalcorrener: 0.325329 hartree
zpe.thermalcorrenthalpy: 0.326273 hartree
zpe.thermalcorrgfe: 0.261553 hartree
zpe.sumelectzpe: -845.735463 hartree
zpe.sumelectthermal: -845.717177 hartree
zpe.sumelectthermalent: -845.716233 hartree
zpe.sumelectthermalfe: -845.780954 hartree
dipole: -1.0678 0.0117 -2.3506
dipole: 2.5818
quadrupole: -104.5226 -104.0842 -125.4839
quadrupole: 0.0112 -3.2329 0.0157
quadrupole: 6.8409 7.2794 -14.1203 0.0112 -3.2329 0.0157
hfenergy: -846.0425064 hartree
pointgroup: C01 [X(C18H18O2)]
dipole: 0.4314058 -0.0290526 -0.9191337 debye
polarizability: 223.3931736|1.1400875|252.1250898|20.3640458|-2.3627954|122.5422489 unknown
InChI: InChI=1S/C18H18O2/c1-17(2,3)16(19)18(20)14-10-6-4-8-12(14)13-9-5-7-11-15(13)18/h4-11,20H,1-3H3
charge 0 multiplicity 1
38 atoms
O  -1.022906 -0.029131 -1.911011
O  -1.231853 0.03166 1.723861
C  -0.447007 -0.026351 -0.55178
C  -3.102367 0.057222 0.140767
C  0.460562 -1.244994 -0.298503
C  0.52991 1.143813 -0.331594
C  -1.600809 0.022299 0.522134
C  1.761216 -0.821724 0.096703
C  1.803984 0.656721 0.076519
C  -3.476076 -1.225356 -0.663085
C  -3.406294 1.330961 -0.705865
C  -3.938323 0.102508 1.445011
C  0.143195 -2.606441 -0.414086
C  0.292867 2.517788 -0.485504
C  2.757681 -1.77341 0.394198
C  2.854472 1.55635 0.348963
C  1.148377 -3.564594 -0.123578
C  1.352381 3.423265 -0.220151
C  2.44013 -3.149153 0.282831
C  2.617822 2.944728 0.19942
H  -2.893328 -1.297712 -1.59421
H  -3.309432 -2.133648 -0.053882
H  -4.551592 -1.18437 -0.917809
H  -2.831441 1.335501 -1.64469
H  -3.177556 2.248669 -0.131854
H  -4.485351 1.346832 -0.948344
H  -3.699092 0.997126 2.045322
H  -3.742834 -0.780117 2.07786
H  -5.013783 0.124584 1.188439
H  -0.856912 -2.925711 -0.725471
H  -0.686727 2.886239 -0.807769
H  -0.26846 -0.062291 -2.55313
H  3.76116 -1.462556 0.705007
H  3.838169 1.195991 0.66948
H  0.923941 -4.633482 -0.209458
H  1.190651 4.50064 -0.335938
H  3.202865 -3.902277 0.510519
H  3.423158 3.65812 0.407476
