program: Gaussian 09
title: 000132663
version: EM64L-G09RevD.01
frameworkgroup: C1[X(C10H13BrN6O3)]
method: RPBEPBE
basis: SDD
operation: Freq
keyword: #p
keyword: freq=noraman
keyword: PBEPBE/SDD
title: #p freq=noraman PBEPBE/SDD
converged: YES YES NO NO
title: Mulliken charges:
elementType: Br O O O N N N N N N C C C C C C C C C C H H H H H H H H H H H H H
charge: 0.028923 -0.244923 -0.439555 -0.488806 -0.180301 0.011432 -0.525562 -0.039325 -0.080017 -0.607661 -0.168382 -0.161202 -0.083551 -0.073262 -0.440430 0.192157 0.147186 -0.380073 0.193043 -0.346103 0.293882 0.231252 0.276693 0.224900 0.250064 0.209733 0.373043 0.360145 0.256211 0.290587 0.249749 0.338969 0.331184
chargesum: 0.00000
title: Mulliken charges with hydrogens summed into heavy atoms:
elementType: Br O O O N N N N N N C C C C C C C C C C
charge: 0.028923 -0.244923 -0.066512 -0.128661 -0.180301 0.011432 0.021236 -0.039325 -0.080017 0.062492 0.125500 0.070050 0.193142 0.151638 0.019367 0.192157 0.147186 -0.380073 0.193043 -0.096354
polarizability: 2.33274743e+02 -1.06884248e+00 1.94964003e+02 1.88180373e+00 1.05079157e+01 1.07365786e+02
1716.lowfreq: -6.9228 -3.2312 -0.0005 0.0003 0.0003 6.5208 22.6626 32.9548 48.6388
frequency: 22.5302 32.8761 48.6254 73.6510 83.8303 89.0116 117.2901 129.2141 161.3183 178.8784 193.5394 206.1801 221.0399 243.7905 273.1586 285.9544 293.0569 311.8643 332.8265 346.5822 379.0104 429.1622 492.4118 516.1198 516.8909 519.2163 549.9293 561.4606 563.9910 570.2805 632.7986 644.1232 659.1841 662.4908 674.1342 695.0648 732.2963 786.0084 803.4886 833.4663 853.0128 899.2235 913.8440 935.9317 940.9270 957.0831 961.8398 1000.1159 1022.4361 1043.8042 1048.1692 1067.9865 1096.5023 1106.9951 1146.5823 1165.7595 1205.8111 1225.8594 1238.7815 1249.4089 1258.8721 1281.9160 1294.7944 1303.5805 1315.7416 1325.4202 1340.3855 1349.0534 1357.1702 1365.7716 1372.5433 1384.1953 1395.3675 1432.5031 1441.3867 1447.5137 1536.5892 1578.0717 1628.9163 1648.0135 2985.0513 3006.8499 3011.6216 3058.9818 3067.1439 3079.1216 3169.6745 3448.1203 3472.6227 3522.8841 3573.2081 3611.6683 3676.8184
redmass: 6.6407 6.0691 5.3255 4.4036 6.6527 6.7949 2.4347 7.2350 3.4432 1.2706 7.3366 9.3492 3.6182 2.5263 3.0573 6.1927 5.7250 2.3468 4.6229 4.6777 5.7736 5.1955 2.5721 1.1424 1.2612 5.6480 4.2960 4.4919 1.2577 4.3527 5.8518 3.5434 5.9715 2.4574 8.6997 6.1722 4.2094 3.4001 11.6677 5.6272 3.5378 6.1138 2.4202 2.9082 1.4419 2.8980 3.6269 2.3268 3.3473 3.6982 4.7932 2.7977 4.7204 2.7170 1.4098 1.4943 3.0924 1.9794 2.5346 1.7024 1.2441 1.3344 2.1551 2.0703 1.5375 2.7827 1.2526 6.9173 1.4174 1.9866 1.2022 1.7051 1.2171 6.0598 3.0504 1.0873 6.8292 2.5880 2.0189 1.0875 1.0630 1.0852 1.0876 1.1010 1.0871 1.0869 1.0925 1.0449 1.0644 1.0450 1.0967 1.0670 1.1054
irintensity: 0.4710 1.9120 5.6787 2.2376 0.7694 0.1105 8.6577 1.8360 3.5227 174.8223 3.8187 6.1468 9.2836 16.7851 35.1670 19.0884 1.4397 9.4138 12.2466 6.0207 1.4578 3.0257 22.7014 149.8369 108.6872 7.6760 10.6889 30.7564 85.0944 36.0533 38.0861 48.0341 40.9890 175.5030 19.4443 31.5862 66.3430 28.1533 8.4619 3.6898 34.3304 30.1751 26.4090 140.6455 10.9445 25.7070 60.6904 22.7140 10.8378 68.0012 119.2471 57.0495 50.6134 36.3935 21.6558 9.3807 54.1025 25.4855 69.0642 11.3916 7.3894 35.9201 13.1275 4.6316 13.6570 81.4564 1.3843 10.0692 2.7190 47.3723 4.8534 22.9045 36.6871 123.7574 7.8856 18.4945 196.2460 103.5392 524.4070 35.3611 30.8767 41.4831 50.3068 32.8392 3.1126 7.0197 17.1920 1.4480 54.6579 95.9414 1.9343 19.3465 67.7424
temp: 298.150 k
press: 1.00000 atm
elementType: 35 8 8 8 7 7 7 7 7 7 6 6 6 6 6 6 6 6 6 6 1 1 1 1 1 1 1 1 1 1 1 1 1
symmnumber: 1
zpe: 644119.6 jmol-1
zpe.correction: 0.245332 hartree
zpe.thermalcorrener: 0.264428 hartree
zpe.thermalcorrenthalpy: 0.265372 hartree
zpe.thermalcorrgfe: 0.196240 hartree
zpe.sumelectzpe: -954.973956 hartree
zpe.sumelectthermal: -954.954860 hartree
zpe.sumelectthermalent: -954.953916 hartree
zpe.sumelectthermalfe: -955.023048 hartree
dipole: -1.2094 -1.7024 0.9059
dipole: 2.2763
quadrupole: -79.1746 -138.4603 -133.3845
quadrupole: 0.7062 -4.6009 2.3466
quadrupole: 37.8319 -21.4538 -16.3781 0.7062 -4.6009 2.3466
hfenergy: -955.2192886 hartree
pointgroup: C01 [X(C10H13Br1N6O3)]
dipole: 0.6813876 -0.5630713 -0.1438579 debye
polarizability: 227.9281138|15.8410097|183.8981284|6.1814518|-35.4723299|123.778289 unknown
InChI: InChI=1S/C10H13BrN6O3/c11-7-4-8(13)14-2-15-9(4)17(16-7)10-6(19)5(18)3(1-12)20-10/h2-3,5-6,10,18-19H,1,12-13H2
charge 0 multiplicity 1
33 atoms
Br -1.817252 -3.007654 1.762561
O  2.02332 0.257813 -1.096761
O  1.947054 2.41547 1.83344
O  4.00457 2.182784 0.244205
N  -0.035051 0.252535 0.158053
N  -0.035934 -0.95093 0.885789
N  2.936215 -2.567959 -1.095804
N  -1.667474 1.647273 -1.052548
N  -3.948412 0.737902 -0.97256
N  -4.522407 -1.246754 0.132546
C  2.08811 1.127764 1.192046
C  3.529823 0.856855 0.681077
C  1.212709 0.972054 -0.096376
C  3.327102 -0.133575 -0.478881
C  3.29254 -1.623097 -0.028491
C  -1.303675 0.563207 -0.309748
C  -2.177776 -0.478637 0.14538
C  -1.31817 -1.366586 0.867775
C  -3.556944 -0.344418 -0.223587
C  -2.999844 1.6555 -1.33862
H  1.787561 0.369283 1.931826
H  4.187253 0.451535 1.474965
H  0.917136 1.948543 -0.515768
H  4.079385 -0.0047 -1.281138
H  2.55868 -1.743016 0.789217
H  4.289274 -1.89509 0.372919
H  2.572952 3.034329 1.364924
H  4.927731 2.130035 -0.101554
H  3.626763 -2.627596 -1.852157
H  1.993671 -2.399875 -1.463497
H  -3.361747 2.498638 -1.934199
H  -5.477667 -1.068857 -0.174397
H  -4.300995 -2.071178 0.687863
