program: Gaussian 09
title: 000132660
version: EM64L-G09RevD.01
frameworkgroup: C1[X(C16H19ClN2O4)]
method: RPBEPBE
basis: SDD
operation: Freq
keyword: #p
keyword: freq=noraman
keyword: PBEPBE/SDD
title: #p freq=noraman PBEPBE/SDD
converged: YES YES NO NO
title: Mulliken charges:
elementType: Cl O O O O N N C C C C C C C C C C C C C C C C H H H H H H H H H H H H H H H H H H H
charge: 0.029649 -0.245428 -0.444248 -0.216393 -0.294899 -0.117814 -0.107430 -0.381004 -0.115324 -0.341938 -0.344329 -0.374245 -0.316726 -0.314717 0.362032 0.402673 -0.537617 0.330814 -0.358282 -0.348580 -0.229120 -0.225158 -0.229491 0.226713 0.229013 0.222433 0.206005 0.201951 0.199284 0.214348 0.247693 0.263334 0.217267 0.185942 0.187545 0.215850 0.372074 0.254495 0.263434 0.236544 0.235862 0.237787
chargesum: 0.00000
title: Mulliken charges with hydrogens summed into heavy atoms:
elementType: Cl O O O O N N C C C C C C C C C C C C C C C C
charge: 0.029649 -0.245428 -0.072174 -0.216393 -0.294899 -0.117814 -0.107430 0.074722 0.107108 0.066019 0.069303 0.136783 0.086484 0.088678 0.362032 0.402673 -0.537617 0.330814 -0.103787 -0.085145 0.007424 0.010704 0.008296
polarizability: 2.64199356e+02 -4.22612987e+01 2.38329904e+02 -2.66725742e+01 -2.47896258e+01 1.47549363e+02
1716.lowfreq: -11.3883 -5.2615 -0.0016 -0.0010 0.0011 1.2766 11.3404 15.4799 16.5839
frequency: 10.1693 15.4378 16.0482 23.5317 48.7862 79.0612 86.0358 106.4493 118.8559 159.9296 172.4866 189.7585 217.6237 236.6654 248.2518 273.5660 298.8519 300.9017 314.9347 327.8665 345.0867 351.1383 386.7149 398.4814 418.6768 425.0778 456.0002 468.7100 486.2146 578.0385 580.5531 608.5199 612.4298 615.8201 651.7016 693.6314 700.8639 710.7029 755.7702 770.3982 779.2956 795.3217 807.8698 830.5696 839.7570 853.8880 885.6582 895.0323 932.4132 936.1048 977.7250 985.8120 988.4216 996.1121 1005.1217 1009.2947 1022.9188 1027.3596 1040.3114 1051.6392 1075.9990 1079.6859 1098.6993 1101.7515 1104.9702 1129.9470 1145.7551 1165.1759 1179.2086 1190.5058 1201.4520 1209.6672 1236.7733 1263.0790 1272.5535 1280.8721 1290.7962 1293.7734 1299.5766 1330.3498 1332.8594 1335.9783 1344.5935 1361.3036 1363.6437 1370.5997 1384.6340 1386.6291 1436.2777 1439.0864 1442.6974 1448.0869 1449.8247 1452.3266 1459.6740 1474.8028 1479.9514 1580.0124 1601.9780 1604.8433 1618.1860 2873.0259 2880.4583 2922.8651 2947.9346 2953.1314 2998.3355 3018.1718 3029.9379 3034.1816 3044.2390 3080.8085 3082.7663 3083.9212 3135.4116 3147.0757 3160.7252 3172.3370 3182.3862 3217.5729
redmass: 5.1191 4.0839 3.4280 6.5632 6.5693 5.4927 6.7961 5.2583 6.2315 8.9487 6.1763 3.7994 4.1356 1.8158 6.3535 6.3277 4.8814 4.6511 4.9505 10.5101 2.2663 7.5785 2.0302 2.8072 2.6806 5.7751 4.0435 2.7586 5.3007 3.7202 7.1729 2.0513 5.9868 6.1824 7.3991 1.8823 5.7381 5.8166 1.2259 3.4530 1.8848 4.6668 3.8328 3.0408 1.6373 1.2526 2.6236 2.4041 6.6580 1.4234 3.7216 1.3893 6.1485 2.6999 1.3307 2.5005 3.6399 2.1865 3.0744 2.0484 3.1187 3.0756 1.7711 2.3070 2.6132 2.6683 2.6386 6.8612 1.0561 1.0663 1.1289 1.4236 2.2479 1.3663 1.3071 1.4289 1.3398 1.2538 1.7564 1.3068 1.4014 1.3984 1.3042 1.8464 1.4450 1.2732 7.2224 1.4325 1.2160 2.3207 1.0830 1.0801 1.1044 1.1641 1.0988 1.0904 2.2262 5.9431 8.9499 7.6861 6.7141 1.0704 1.0689 1.0683 1.0670 1.0668 1.0614 1.0840 1.0896 1.0911 1.0919 1.0954 1.1012 1.0973 1.0857 1.0895 1.0942 1.0974 1.0977 1.0684
irintensity: 0.1920 0.0133 0.1294 0.1613 0.4350 1.3235 0.9222 2.0584 0.8434 1.7217 1.5944 9.2909 2.1822 1.1099 7.9157 2.0915 0.5276 14.2992 5.8776 4.5730 0.1016 14.3112 0.9359 0.0051 6.6695 8.7683 3.7465 0.9378 4.0991 13.1321 11.5402 14.6678 4.7071 3.3869 4.7931 41.6616 13.0690 18.9252 175.6815 30.7000 49.4567 7.9118 26.7416 16.8257 1.2899 0.0183 2.3519 7.8479 38.7163 4.5167 15.1864 0.0276 0.9746 17.0265 0.1352 24.8229 43.2526 10.3699 31.0942 20.8157 43.6276 75.5657 2.9328 19.1957 33.5827 28.0213 15.5938 14.0350 0.2127 1.3886 8.1154 2.7618 28.4490 31.4968 20.1492 54.8529 10.2899 3.2949 3.5769 4.9143 7.4531 5.6095 21.3476 37.7993 10.0540 1.7769 2.3609 1.5779 207.3652 18.5107 2.1851 2.2558 4.3289 12.6954 2.0410 22.2199 19.9289 8.0484 108.6961 288.2045 4.0283 49.5523 105.9448 69.7195 35.7879 98.2206 18.6976 24.1401 30.7767 35.4810 73.5078 40.4784 2.4249 38.5272 0.0910 10.0788 19.8843 11.0621 11.8148 376.4443
temp: 298.150 k
press: 1.00000 atm
elementType: 17 8 8 8 8 7 7 6 6 6 6 6 6 6 6 6 6 6 6 6 6 6 6 1 1 1 1 1 1 1 1 1 1 1 1 1 1 1 1 1 1 1
symmnumber: 1
zpe: 868514.2 jmol-1
zpe.correction: 0.330800 hartree
zpe.thermalcorrener: 0.352107 hartree
zpe.thermalcorrenthalpy: 0.353051 hartree
zpe.thermalcorrgfe: 0.275959 hartree
zpe.sumelectzpe: -1489.756378 hartree
zpe.sumelectthermal: -1489.735071 hartree
zpe.sumelectthermalent: -1489.734127 hartree
zpe.sumelectthermalfe: -1489.811219 hartree
dipole: -3.4208 4.7612 -1.2163
dipole: 5.9875
quadrupole: -129.9113 -162.8766 -139.8094
quadrupole: -8.2255 -5.4128 -6.2677
quadrupole: 14.2878 -18.6775 4.3897 -8.2255 -5.4128 -6.2677
hfenergy: -1490.0871779 hartree
pointgroup: C01 [X(C16H19Cl1N2O4)]
dipole: 1.3044688 1.7581505 0.8697443 debye
polarizability: 252.9486648|54.828767|225.1221941|-24.8860591|39.3476564|172.0077645 unknown
InChI: InChI=1S/C16H19ClN2O4/c17-14-15(12-4-2-1-3-5-12)23-19(16(14)21)11-13(20)10-18-6-8-22-9-7-18/h1-5,13,20H,6-11H2
charge 0 multiplicity 1
42 atoms
Cl 2.814345 -1.718033 -2.552036
O  -4.660547 2.672084 0.132714
O  -2.195689 -3.500668 0.038557
O  0.878656 -0.142762 0.606509
O  0.004262 -2.932038 -1.45716
N  -3.252014 0.141378 -0.115142
N  -0.020537 -1.213068 0.178187
C  -2.933416 -1.219554 -0.612842
C  -2.356362 -2.131426 0.499341
C  -4.586835 0.222631 0.536077
C  -3.128067 1.198245 -1.153738
C  -1.074156 -1.539268 1.150297
C  -4.787185 1.617443 1.151395
C  -3.340636 2.58054 -0.515116
C  0.536631 -1.919451 -0.894427
C  1.973844 -0.170474 -0.30191
C  1.784005 -1.208937 -1.193743
C  2.977208 0.873127 -0.080679
C  4.187997 0.905591 -0.828575
C  2.744178 1.873024 0.907863
C  5.138176 1.919385 -0.591087
C  3.699677 2.881496 1.137415
C  4.900637 2.910516 0.389377
H  -3.823157 -1.738969 -1.037674
H  -2.192718 -1.137465 -1.429941
H  -3.083184 -2.206605 1.330254
H  -4.659377 -0.54128 1.332756
H  -5.405527 0.024412 -0.200145
H  -3.873607 1.059046 -1.97558
H  -2.115511 1.149368 -1.596468
H  -1.350159 -0.585795 1.63255
H  -0.690232 -2.254793 1.902217
H  -5.803114 1.727974 1.565243
H  -4.036446 1.780618 1.955437
H  -2.54197 2.767713 0.235564
H  -3.330521 3.378291 -1.276019
H  -1.453671 -3.51488 -0.646319
H  4.387013 0.143277 -1.585814
H  1.816229 1.853927 1.487094
H  6.066462 1.934075 -1.171849
H  3.508969 3.645228 1.898731
H  5.642652 3.695775 0.569488
