program: Gaussian 09
title: 000132658
version: EM64L-G09RevD.01
frameworkgroup: C1[X(C11H14ClN3)]
method: RPBEPBE
basis: SDD
operation: Freq
keyword: #p
keyword: freq=noraman
keyword: PBEPBE/SDD
title: #p freq=noraman PBEPBE/SDD
converged: YES YES NO NO
title: Mulliken charges:
elementType: Cl N N N C C C C C C C C C C C H H H H H H H H H H H H H H
charge: -0.036582 0.009005 0.077699 0.023602 -0.158664 -0.161881 -0.461277 -0.478963 -0.510342 -0.454621 -0.436142 0.229355 -0.445687 -0.222792 -0.248337 0.230612 0.212012 0.205097 0.248888 0.215932 0.216251 0.230171 0.259125 0.249520 0.224577 0.227296 0.228197 0.257623 0.270328
chargesum: 0.00000
title: Mulliken charges with hydrogens summed into heavy atoms:
elementType: Cl N N N C C C C C C C C C C C
charge: -0.036582 0.009005 0.077699 0.023602 0.071948 0.050131 -0.007293 -0.046780 -0.021046 0.019476 0.019352 0.229355 -0.188064 -0.222792 0.021991
polarizability: 1.99898975e+02 -4.44247926e+00 1.48267955e+02 3.91145700e+00 -6.24289075e-01 9.48514379e+01
1716.lowfreq: -26.2131 -19.4576 0.0007 0.0010 0.0011 6.1056 13.5028 30.0013 79.1775
frequency: -18.8700 28.4286 79.0585 121.3535 149.4710 214.6543 251.6998 256.1282 314.6579 334.6803 376.3004 397.4230 408.4741 469.9571 536.8384 552.7674 583.9405 602.4113 623.8060 683.4206 745.0980 752.1349 788.4458 801.2208 807.4302 841.2142 865.1730 873.5209 893.8504 919.5781 936.0169 946.8225 956.0905 982.9010 996.5311 1005.6246 1043.8376 1066.4200 1090.6015 1120.4126 1128.8157 1151.2316 1162.1503 1193.1923 1212.1968 1222.0576 1233.4738 1249.0971 1257.4458 1295.5967 1306.8516 1310.2248 1316.6395 1321.7559 1324.5090 1331.4289 1342.4734 1348.9632 1380.6348 1402.6357 1450.4701 1457.2769 1465.9021 1466.8139 1478.2207 1482.1964 1512.8203 2980.7544 2981.5002 2994.1608 3000.8249 3005.3195 3008.1759 3026.8106 3037.6571 3057.6117 3067.1173 3076.3044 3081.3169 3145.4479 3173.2134
redmass: 3.1648 4.6776 4.5213 3.6173 4.2471 2.7914 5.0256 3.2021 2.4809 4.3228 4.1020 3.0245 2.3357 9.4673 4.1332 4.0538 7.6471 5.9236 6.9662 3.9606 4.1429 3.3219 1.5693 2.2605 1.6137 2.3996 1.6640 2.9255 3.5535 1.6088 1.9680 4.2582 3.5130 2.3740 2.8286 3.4532 3.0635 2.7016 1.7948 2.8666 1.7276 2.0608 1.3826 1.3460 1.3713 1.4848 1.2714 4.2690 1.3849 1.3231 1.3405 1.3263 1.3745 1.3874 1.5435 1.3027 1.3675 1.5317 1.7578 2.3346 1.0909 1.0813 1.0913 1.0830 1.2162 3.4943 6.7155 1.0823 1.0605 1.0624 1.0608 1.0605 1.0636 1.0849 1.1039 1.1013 1.1057 1.1059 1.1049 1.0920 1.0950
irintensity: 0.1474 0.1569 0.4736 0.2866 0.2315 0.7040 2.6953 0.2190 1.9895 2.5012 7.5976 10.0253 0.9360 7.8415 1.1915 1.7105 11.1438 3.5961 1.6667 6.3435 28.0807 20.0305 7.7521 17.1228 26.7131 20.3899 19.4886 0.8288 53.6577 4.0147 9.7304 6.8351 28.1835 4.8220 4.8473 11.3023 16.1702 13.8183 11.5021 19.3307 17.3369 122.7308 10.8142 25.5437 10.0488 0.5018 14.1925 4.2293 4.7305 4.9466 15.7761 16.4472 3.8798 0.7561 2.7110 0.6208 3.3684 11.7336 115.5644 18.6254 11.4456 2.4280 11.8958 14.2845 14.5275 54.6394 141.3412 23.7159 23.1603 13.5461 85.0043 79.9494 65.4449 36.4579 7.0200 1.1650 33.4540 29.9207 57.5035 13.6794 2.0773
temp: 298.150 k
press: 1.00000 atm
elementType: 17 7 7 7 6 6 6 6 6 6 6 6 6 6 6 1 1 1 1 1 1 1 1 1 1 1 1 1 1
symmnumber: 1
zpe: 621218.9 jmol-1
zpe.correction: 0.236610 hartree
zpe.thermalcorrener: 0.248267 hartree
zpe.thermalcorrenthalpy: 0.249212 hartree
zpe.thermalcorrgfe: 0.197819 hartree
zpe.sumelectzpe: -1050.731214 hartree
zpe.sumelectthermal: -1050.719556 hartree
zpe.sumelectthermalent: -1050.718612 hartree
zpe.sumelectthermalfe: -1050.770005 hartree
dipole: -2.1052 1.8067 1.0184
dipole: 2.9552
quadrupole: -96.2260 -100.3277 -97.0486
quadrupole: -4.7027 -3.6011 -3.7386
quadrupole: 1.6414 -2.4603 0.8188 -4.7027 -3.6011 -3.7386
hfenergy: -1050.9678239 hartree
pointgroup: C01 [X(C11H14Cl1N3)]
dipole: -0.6435562 -0.0504543 -0.9670042 debye
polarizability: 196.3244542|3.102145|110.2252512|14.2120085|25.2074348|136.4686624 unknown
InChI: InChI=1S/C11H14ClN3/c12-11-6-13-5-10(14-11)9-7-15-3-1-8(9)2-4-15/h5-6,8-9H,1-4,7H2
charge 0 multiplicity 1
29 atoms
Cl 3.124196 1.084231 2.51512
N  -2.693529 -0.357164 1.060088
N  1.220518 0.065969 0.858642
N  3.081916 -0.962859 -1.004804
C  -1.414369 0.548356 -1.010618
C  -0.707296 -0.756164 -0.481527
C  -1.471066 1.637691 0.092587
C  -2.865773 0.160507 -1.409739
C  -1.485993 -1.190583 0.832908
C  -2.281538 1.059538 1.309631
C  -3.585897 -0.419562 -0.135793
C  0.775823 -0.594877 -0.266121
C  1.736099 -1.108916 -1.181766
C  2.539031 0.204319 1.020395
C  3.50012 -0.294223 0.10705
H  -0.86848 0.92734 -1.894229
H  -0.83944 -1.527862 -1.266493
H  -1.963957 2.538226 -0.320301
H  -0.453748 1.927667 0.405286
H  -2.852331 -0.578361 -2.233915
H  -3.38903 1.060582 -1.783562
H  -1.796277 -2.248138 0.757133
H  -0.826441 -1.078607 1.710504
H  -1.672079 1.076458 2.229474
H  -3.1979 1.647098 1.49948
H  -4.505854 0.146847 0.094744
H  -3.875547 -1.475409 -0.287031
H  1.420127 -1.653046 -2.077561
H  4.574716 -0.168858 0.259619
