program: Gaussian 09
title: 000132644
version: EM64L-G09RevD.01
frameworkgroup: C1[X(C18H16N4O)]
method: RPBEPBE
basis: SDD
operation: Freq
keyword: #p
keyword: freq=noraman
keyword: PBEPBE/SDD
title: #p freq=noraman PBEPBE/SDD
converged: YES YES NO NO
title: Mulliken charges:
elementType: O N N N N C C C C C C C C C C C C C C C C C C H H H H H H H H H H H H H H H H
charge: -0.273249 -0.549811 -0.452058 -0.047623 -0.004149 0.179513 0.134929 0.356686 -0.078365 0.186076 -0.449793 -0.345906 -0.384696 0.143308 -0.463853 0.519658 -0.793631 -0.526276 -0.485297 0.358185 -0.183276 -0.396173 -0.535775 0.271207 0.262829 0.244755 0.305910 0.341352 0.270186 0.228273 0.253937 0.228849 0.292977 0.230283 0.225020 0.245346 0.221547 0.222573 0.246532
chargesum: 0.00000
title: Mulliken charges with hydrogens summed into heavy atoms:
elementType: O N N N N C C C C C C C C C C C C C C C C C C
charge: -0.273249 -0.243900 -0.110706 -0.047623 -0.004149 0.179513 0.134929 0.356686 -0.078365 0.186076 -0.178586 -0.083078 -0.139941 0.143308 -0.193667 0.519658 -0.082572 -0.233299 -0.255014 0.358185 0.041744 -0.150827 0.154877
polarizability: 3.51272888e+02 -1.11923088e+01 2.65485947e+02 -9.61774917e+00 -9.20958629e+00 1.29807805e+02
1716.lowfreq: -4.0739 -0.0010 -0.0005 0.0001 4.0601 6.9006 25.2242 36.3448 44.6566
frequency: 25.1732 36.3335 44.6345 47.5315 75.4006 90.3452 123.8084 152.2562 182.3308 193.4920 205.1715 217.7203 239.5399 257.0251 260.5482 266.1051 305.3401 355.2708 386.5158 408.3949 433.1916 450.5656 471.4487 487.8772 506.5603 521.4037 546.8168 583.9147 589.6107 602.4558 610.6095 615.0507 629.3140 638.2221 683.0463 685.6797 704.7367 714.0550 740.8998 772.1749 790.5435 809.1467 828.4705 849.1280 856.6220 863.1878 900.7175 904.2492 909.4797 956.3084 967.4727 977.9189 979.4425 984.5635 1000.8405 1021.4782 1033.7574 1046.5524 1054.1750 1094.1769 1110.8201 1119.2329 1152.3203 1168.2733 1180.3542 1197.5158 1198.8275 1222.8930 1263.1486 1268.6523 1290.5547 1301.1449 1316.3380 1352.1261 1374.3033 1376.1380 1385.6839 1394.1674 1398.7740 1424.0812 1435.8302 1439.1658 1461.9010 1466.2367 1468.0377 1468.4715 1472.4718 1480.0111 1506.1974 1530.6365 1576.2384 1580.6443 1595.3906 1618.9200 1626.4882 2961.5054 2982.1026 3050.5664 3059.4921 3117.9743 3122.6108 3125.5930 3145.6361 3147.6328 3166.9992 3175.1240 3175.6521 3177.6422 3224.3774 3502.0946 3611.4169
redmass: 4.6522 4.0126 2.1922 1.5020 4.3118 3.6209 5.1836 5.2770 3.2867 1.8593 5.4317 3.3986 3.9287 2.3770 3.1291 4.4620 4.4989 4.3302 5.0249 5.2996 4.9502 2.7590 4.0111 2.8921 1.9676 4.9340 4.7648 5.1044 5.9680 3.8339 3.4536 5.0226 5.0674 5.4599 2.3576 1.6614 2.4171 5.1408 3.2781 1.6292 3.3023 4.5004 1.7151 1.4531 1.5724 1.5519 1.7766 3.7075 3.5006 1.3148 5.0633 4.0010 1.3477 2.5244 4.0774 3.0117 2.8322 1.6020 3.3960 1.6701 1.2586 1.6799 1.4116 1.4235 1.5802 1.5217 1.6424 2.2015 2.2897 2.6298 1.8673 2.1721 3.6604 3.4373 3.1148 3.7513 1.4857 3.2386 4.8804 2.3391 2.0886 1.5133 1.8436 1.0526 1.4942 1.0540 1.4504 2.2975 2.3685 4.2595 6.1860 6.7909 4.8098 7.6083 6.3001 1.0328 1.0383 1.1041 1.0972 1.0981 1.0878 1.0996 1.0887 1.0931 1.0923 1.0968 1.0938 1.0936 1.0978 1.0753 1.0818
irintensity: 0.0844 1.0219 0.9263 0.2365 0.1466 7.8515 1.0855 0.8989 0.4552 0.8409 2.7714 1.1518 6.7870 1.2015 0.7518 6.8485 0.0345 1.8879 4.9833 1.1651 2.1589 27.0004 6.1032 26.3876 70.0594 6.2582 13.3689 2.4575 2.4967 3.9100 4.8841 19.8339 11.4351 12.4123 26.5143 39.9506 22.3375 2.4071 23.1329 62.7771 2.0036 4.4643 0.6546 0.3920 49.2271 63.1789 0.3528 34.3561 4.8631 0.7687 6.9458 3.8786 0.0621 8.0083 3.5903 80.8497 10.3735 5.0153 1.1073 10.5220 0.2008 10.4123 12.5185 141.2366 20.8767 30.2982 95.5099 6.0556 9.1677 10.7981 31.5443 11.1394 17.8728 26.4417 69.1451 11.4571 33.5050 81.7256 9.8431 14.9595 42.8639 7.4860 64.6843 12.8225 10.9489 18.0598 32.1614 105.9253 182.1528 265.4241 61.7533 248.8042 59.3276 62.7837 231.0743 74.7190 23.7932 45.5160 18.5362 10.7195 9.6870 22.5607 5.7316 17.4580 7.2878 14.6898 7.9680 2.8925 4.0251 18.0887 59.2171
temp: 298.150 k
press: 1.00000 atm
elementType: 8 7 7 7 7 6 6 6 6 6 6 6 6 6 6 6 6 6 6 6 6 6 6 1 1 1 1 1 1 1 1 1 1 1 1 1 1 1 1
symmnumber: 1
zpe: 799447.7 jmol-1
zpe.correction: 0.304494 hartree
zpe.thermalcorrener: 0.323858 hartree
zpe.thermalcorrenthalpy: 0.324803 hartree
zpe.thermalcorrgfe: 0.255550 hartree
zpe.sumelectzpe: -988.141938 hartree
zpe.sumelectthermal: -988.122574 hartree
zpe.sumelectthermalent: -988.121629 hartree
zpe.sumelectthermalfe: -988.190882 hartree
dipole: -4.5257 -0.6001 1.0530
dipole: 4.6852
quadrupole: -105.5231 -140.7804 -135.5045
quadrupole: 0.6170 1.0721 -4.5094
quadrupole: 21.7463 -13.5111 -8.2352 0.6170 1.0721 -4.5094
hfenergy: -988.446432 hartree
pointgroup: C01 [X(C18H16N4O1)]
dipole: 1.7881333 -0.1921217 -0.4042933 debye
polarizability: 350.8953211|13.0517137|265.6711919|-7.9810927|11.2657758|130.0001275 unknown
InChI: InChI=1S/C18H16N4O/c1-11-8-16(21-13-4-3-5-14(9-13)23-2)17-15(20-11)7-6-12-10-19-22-18(12)17/h3-10,21-22H,1-2H3
charge 0 multiplicity 1
39 atoms
O  4.672151 0.718542 1.362491
N  0.481748 -0.648756 -0.653224
N  -1.795936 -2.343013 0.254104
N  -2.16693 2.667826 -0.093921
N  -2.76347 -3.318631 0.517227
C  -1.74103 0.220026 -0.089397
C  -2.339682 -1.064352 0.133383
C  -0.35078 0.463658 -0.380037
C  -2.626402 1.362697 -0.009652
C  -3.748217 -1.230571 0.316425
C  0.092202 1.79662 -0.444317
C  -4.047943 1.176773 0.172482
C  -4.610752 -0.086576 0.312598
C  -0.838115 2.868191 -0.2761
C  -3.941086 -2.637862 0.5363
C  1.898744 -0.714651 -0.589258
C  -0.358564 4.304303 -0.338237
C  2.641928 0.048825 0.340451
C  2.572801 -1.63818 -1.439647
C  4.047648 -0.095363 0.405161
C  3.969853 -1.77746 -1.348463
C  4.730359 -1.009106 -0.436797
C  6.125405 0.602217 1.508281
H  1.135459 2.026078 -0.674198
H  -4.655717 2.085644 0.197552
H  -5.690746 -0.209258 0.444106
H  0.040584 -1.387673 -1.207924
H  -0.81569 -2.600431 0.346398
H  -4.866959 -3.181019 0.717484
H  0.130641 4.522503 -1.306204
H  -1.215618 4.983474 -0.213636
H  0.381857 4.513119 0.456631
H  2.157409 0.734025 1.040295
H  2.005386 -2.228893 -2.168845
H  4.481902 -2.48894 -2.005583
H  5.81591 -1.128908 -0.393645
H  6.647522 0.883651 0.573273
H  6.419633 -0.423055 1.805201
H  6.389896 1.309925 2.307539
