program: Gaussian 09
title: 000132615
version: EM64L-G09RevD.01
frameworkgroup: C1[X(C21H36O2)]
method: RPBEPBE
basis: SDD
operation: Freq
keyword: #pfreq=noraman
keyword: PBEPBE/SDD
title: #p freq=noraman PBEPBE/SDD
converged: YES YES NO NO
title: Mulliken charges:
elementType: O O C C C C C C C C C C C C C C C C C C C C C H H H H H H H H H H H H H H H H H H H H H H H H H H H H H H H H H H H H
charge: -0.441766 -0.441858 -0.386359 -0.386698 -0.386326 -0.383323 -0.386524 -0.393302 -0.385027 -0.375088 -0.389565 -0.022513 -0.363873 -0.394986 -0.566243 -0.716910 -0.715682 0.632874 -0.652694 -0.639816 0.360127 0.362330 -0.511194 0.193836 0.193551 0.192764 0.193089 0.193718 0.193286 0.192940 0.191641 0.193851 0.194439 0.203186 0.188182 0.193356 0.194010 0.187784 0.188526 0.196468 0.195145 0.191775 0.193405 0.191602 0.211153 0.212207 0.204225 0.204755 0.203010 0.209697 0.222487 0.205513 0.211271 0.212218 0.226434 0.225715 0.274490 0.352284 0.352403
chargesum: 0.00000
title: Mulliken charges with hydrogens summed into heavy atoms:
elementType: O O C C C C C C C C C C C C C C C C C C C C C
charge: -0.089482 -0.089455 0.001028 -0.000845 0.000678 0.001259 0.001767 -0.001934 0.002339 0.001222 0.002047 0.169262 0.021133 0.028374 -0.157263 -0.081717 -0.086679 0.632874 -0.426260 -0.414101 0.360127 0.362330 -0.236704
polarizability: 3.12355984e+02 -2.52448554e+00 2.22658112e+02 -2.09075094e+01 -1.56579544e+00 1.83573669e+02
1716.lowfreq: -1.2014 -0.0021 0.0007 0.0012 4.5217 8.4698 10.9687 15.5039 18.3591
frequency: 8.0574 14.8804 17.1485 26.6505 37.3115 39.7405 52.6053 67.9597 74.7186 81.6855 102.6889 108.9310 114.8898 134.9057 135.8734 139.3229 157.7296 158.8529 190.2174 201.7532 214.6670 226.8787 227.8370 237.3127 265.8040 277.2292 305.9772 320.3538 346.2072 349.3396 361.1421 379.4487 396.6444 436.0873 447.2878 489.3498 495.0877 502.4654 506.1241 523.0709 577.9705 599.2412 641.4440 690.7994 719.4675 720.7063 725.1767 734.5022 751.7927 778.0752 810.4387 824.3169 827.8305 828.5587 856.8246 868.6977 911.3400 914.8087 935.6837 951.6752 958.9132 959.7227 975.6753 978.9750 982.9919 990.9509 1007.9253 1011.9468 1026.1808 1039.7395 1046.8871 1054.8604 1070.5731 1078.2708 1080.8340 1081.4439 1093.8763 1094.3378 1114.1853 1138.5017 1148.8266 1172.3493 1175.2396 1178.2711 1192.2786 1196.3807 1198.4392 1216.5893 1223.3228 1240.6220 1246.6367 1261.6056 1267.9649 1276.0944 1279.2966 1283.5838 1287.4930 1289.3427 1292.2947 1296.3644 1298.6395 1300.0900 1305.4884 1319.8388 1329.7663 1331.2077 1338.4250 1346.7302 1353.9340 1354.4165 1357.8138 1358.3618 1374.4142 1390.9206 1402.6798 1446.6392 1454.7778 1459.2481 1459.6634 1461.9584 1462.5814 1464.5976 1466.8907 1468.2361 1470.9215 1472.6700 1477.6070 1479.8909 1482.6926 1486.3410 1488.3693 1488.9289 1514.9659 1611.6777 1633.1331 2943.6720 2948.0243 2948.1043 2949.2675 2949.8859 2951.1468 2951.7892 2953.6147 2957.6822 2961.6866 2964.4387 2965.0188 2968.7433 2969.5274 2978.7812 2981.0790 2983.2677 2986.5614 2990.5638 2995.1312 3002.8941 3011.8263 3019.1149 3027.5821 3036.0704 3042.2669 3049.2196 3056.3630 3063.4773 3066.6623 3071.6578 3107.1880 3112.1788 3192.2783 3583.5860 3585.0320
redmass: 4.0826 4.1738 4.5159 2.9934 2.8052 4.6378 1.9169 2.4089 4.3868 1.8925 2.2170 2.6373 2.6391 2.0131 4.1645 2.0101 1.9842 2.0295 2.9225 1.1662 4.7185 2.6010 3.9529 1.3485 3.2528 2.6497 4.0725 3.8652 3.0012 1.1243 1.1125 2.8017 2.4350 2.4511 3.0930 2.9708 3.1221 3.0200 6.5466 5.9257 4.5076 4.3661 3.9574 1.8899 1.0577 1.0663 1.0821 1.1095 1.1579 1.2287 2.0807 1.4366 1.6499 1.4373 1.7169 1.2892 1.1844 1.3512 1.8199 1.4670 4.8673 2.1766 1.6619 5.0672 5.9480 3.8373 4.2233 1.2962 3.0160 1.2153 3.1753 3.1203 2.6167 2.1547 2.1862 2.1680 1.7638 2.2526 1.3312 2.4174 1.5153 1.2544 1.7526 2.0086 1.6228 1.4098 1.2874 1.5188 1.2975 1.3959 1.2872 1.3046 1.2779 1.1418 1.0768 1.0680 1.2755 1.1628 1.0842 1.2593 1.1026 1.1376 1.3620 1.5445 1.4381 2.2299 2.0535 1.5158 1.5799 1.7121 1.6469 1.6293 1.2195 1.2174 5.9601 3.3689 1.0725 1.0763 1.0726 1.0759 1.0704 1.0660 1.0912 1.0444 1.0724 1.0882 1.0995 1.0577 1.0990 1.0976 1.0854 1.0692 2.9528 6.8662 6.3630 1.0618 1.0588 1.0588 1.0595 1.0591 1.0604 1.0719 1.0645 1.0610 1.0599 1.0423 1.0518 1.0364 1.0591 1.0593 1.0960 1.0966 1.0974 1.0985 1.1012 1.1029 1.1033 1.1039 1.1049 1.1049 1.1046 1.1047 1.0992 1.0992 1.0991 1.0987 1.0910 1.0918 1.0933 1.0660 1.0659
irintensity: 0.1210 0.1314 0.1788 0.1652 0.0066 0.3438 0.0618 0.0086 0.0642 0.0332 0.0068 0.0460 0.0477 0.0137 0.0407 0.0122 0.0052 0.0014 0.3395 0.0845 5.9986 1.8856 0.2401 0.1674 0.0846 1.7401 2.4111 3.0012 2.1373 187.4321 86.6483 0.4108 0.2686 0.2791 0.5425 0.2041 28.7070 0.2232 0.4719 0.8949 6.8057 0.0028 2.4614 35.3735 20.1413 0.1152 3.9611 0.1291 0.6364 0.8819 0.6709 2.0280 23.4380 3.0377 51.9509 2.4996 2.9811 8.2014 6.6788 14.9118 2.2907 68.7861 40.7219 1.0860 3.5562 3.5542 2.7218 2.3703 0.3438 2.0331 1.0352 0.9667 0.2097 0.2546 0.1087 0.0112 17.7530 11.8898 162.1994 9.2268 125.0991 3.4867 17.0186 1.9110 4.9037 17.8380 27.3824 0.8636 0.3820 1.2607 2.9486 2.0231 0.5079 3.7136 1.0378 0.1317 2.9509 4.8689 0.8117 42.0999 4.1881 3.7959 5.6584 3.5989 1.4252 22.8256 7.3972 0.6156 1.3502 0.3795 0.1806 0.2696 20.0878 14.3305 52.7951 65.8542 0.3758 0.0097 0.0123 0.1034 0.0861 0.0929 0.0967 2.5158 2.2157 2.2608 0.2897 8.2053 0.8004 0.7180 11.5687 53.6672 9.3359 151.1074 159.9003 8.5010 0.7177 0.2748 1.5421 1.5090 2.9646 7.6871 2.2026 9.0579 1.6801 42.8667 289.0389 28.9403 20.2823 99.2595 0.0421 1.3966 0.4154 6.0723 1.5824 4.1508 0.5246 1.8198 5.7348 1.0773 227.8059 178.6743 9.6009 85.2404 69.9611 62.9685 24.3394 1.6180 0.0725 46.6149 20.1484
temp: 298.150 k
press: 1.00000 atm
elementType: 8 8 6 6 6 6 6 6 6 6 6 6 6 6 6 6 6 6 6 6 6 6 6 1 1 1 1 1 1 1 1 1 1 1 1 1 1 1 1 1 1 1 1 1 1 1 1 1 1 1 1 1 1 1 1 1 1 1 1
symmnumber: 1
zpe: 1373272.7 jmol-1
zpe.correction: 0.523052 hartree
zpe.thermalcorrener: 0.551104 hartree
zpe.thermalcorrenthalpy: 0.552048 hartree
zpe.thermalcorrgfe: 0.458943 hartree
zpe.sumelectzpe: -970.442969 hartree
zpe.sumelectthermal: -970.414917 hartree
zpe.sumelectthermalent: -970.413973 hartree
zpe.sumelectthermalfe: -970.507078 hartree
dipole: -3.2519 -0.1904 1.5948
dipole: 3.6269
quadrupole: -197.8301 -128.9802 -150.1400
quadrupole: -1.2503 11.8707 -0.8064
quadrupole: -38.8467 30.0033 8.8434 -1.2503 11.8707 -0.8064
hfenergy: -970.9660207 hartree
pointgroup: C01 [X(C21H36O2)]
dipole: 1.2780326 -0.0453348 -0.6330197 debye
polarizability: 312.2035591|3.7988719|222.5448028|-21.1607527|2.7829352|183.8394036 unknown
InChI: InChI=1S/C21H36O2/c1-18(2)13-11-9-7-5-3-4-6-8-10-12-14-19-15-20(22)17-21(23)16-19/h15-18,22-23H,3-14H2,1-2H3
charge 0 multiplicity 1
59 atoms
O  -8.463327 2.397077 1.087905
O  -8.734391 -2.36589 0.71199
C  4.176774 -0.081442 0.342542
C  5.533423 -0.076542 -0.397587
C  2.959346 -0.08187 -0.609141
C  6.751045 -0.068459 0.553776
C  1.602372 -0.085452 0.130362
C  8.108095 -0.065259 -0.186578
C  0.386006 -0.078786 -0.822629
C  9.318808 -0.037277 0.774165
C  -0.971726 -0.079522 -0.084319
C  10.706159 -0.1481 0.085886
C  -2.185897 -0.063144 -1.040068
C  -3.542561 -0.059289 -0.301653
C  -4.755332 -0.028379 -1.273405
C  10.992191 1.050827 -0.850882
C  11.82557 -0.282436 1.145876
C  -6.093374 -0.013025 -0.548477
C  -6.783575 -1.221356 -0.286527
C  -6.644825 1.20998 -0.093377
C  -7.870358 1.21098 0.617035
C  -8.007842 -1.194968 0.427049
C  -8.564444 0.014719 0.885895
H  4.124438 -0.970649 1.005391
H  4.120546 0.805061 1.008721
H  5.583458 0.810568 -1.063513
H  5.592272 -0.96518 -1.060727
H  3.015561 -0.968168 -1.275601
H  3.012555 0.807612 -1.27163
H  6.693446 0.821981 1.214739
H  6.700411 -0.953532 1.222379
H  1.548188 0.798795 0.79964
H  1.546972 -0.976902 0.789866
H  8.143544 0.809865 -0.866343
H  8.174336 -0.966143 -0.832874
H  0.443152 0.812493 -1.482365
H  0.439752 -0.963293 -1.491619
H  9.29042 0.897647 1.374312
H  9.215834 -0.873417 1.497978
H  -1.032264 -0.97325 0.571323
H  -1.023044 0.802061 0.588432
H  10.70309 -1.072698 -0.531452
H  -2.135687 -0.945317 -1.71264
H  -2.1231 0.830343 -1.696677
H  -3.596945 0.817378 0.374894
H  -3.619708 -0.955592 0.346194
H  -4.666134 0.867251 -1.91997
H  -4.697515 -0.910261 -1.941288
H  10.963166 2.001802 -0.283368
H  11.994923 0.962789 -1.309686
H  10.254297 1.122083 -1.670181
H  11.862852 0.618649 1.788721
H  12.81781 -0.398306 0.670957
H  11.656102 -1.157737 1.800869
H  -6.367745 -2.173997 -0.641432
H  -6.120772 2.15327 -0.298844
H  -9.510355 0.025629 1.431353
H  -7.909313 3.181163 0.849586
H  -8.267579 -3.160885 0.353416
