program: Gaussian 09
title: 000132572
version: EM64L-G09RevD.01
frameworkgroup: C1[X(C8H15O11P)]
method: RPBEPBE
basis: SDD
operation: Freq
keyword: #p
keyword: freq=noraman
keyword: PBEPBE/SDD
title: #p freq=noraman PBEPBE/SDD
converged: YES YES NO NO
title: Mulliken charges:
elementType: P O O O O O O O O O O O C C C C C C C C H H H H H H H H H H H H H H H
charge: 1.377993 -0.522170 -0.438827 -0.529942 -0.447988 -0.432221 -0.126773 -0.641083 -0.756711 -0.563971 -0.373778 -0.202994 -0.164266 -0.207496 -0.083249 -0.078659 -0.523568 -0.357800 0.155362 0.110386 0.329287 0.301141 0.265112 0.219108 0.291353 0.292351 0.209320 0.192649 0.354988 0.427646 0.345092 0.353979 0.410066 0.424719 0.390942
chargesum: 0.00000
title: Mulliken charges with hydrogens summed into heavy atoms:
elementType: P O O O O O O O O O O O C C C C C C C C
charge: 1.377993 -0.522170 -0.083838 -0.102296 -0.102896 -0.078243 -0.126773 -0.231016 -0.331992 -0.563971 0.017164 -0.202994 0.165021 0.093645 0.181863 0.140449 0.060137 0.044169 0.155362 0.110386
polarizability: 1.63414608e+02 -4.52828519e+00 1.44971425e+02 2.79386484e+00 -4.45226712e+00 1.29761578e+02
1716.lowfreq: -6.8474 0.0009 0.0010 0.0019 3.2607 9.0014 21.5773 24.1158 27.7426
frequency: 21.2686 24.0276 27.7272 35.1873 49.3929 53.9024 71.8390 97.2165 102.8790 113.2839 122.5644 142.2404 162.5647 176.8959 184.7709 203.6614 214.8165 233.8607 242.8540 261.4363 273.8007 303.5881 314.6541 335.0804 346.3805 361.8206 367.0884 378.3084 392.0762 439.9771 453.3510 485.0848 490.4902 514.0148 548.9941 589.9926 607.2983 631.7458 633.0215 653.9972 674.4179 724.6667 729.7010 753.2036 802.8005 818.0020 825.3903 861.9894 874.8466 904.7018 939.5830 957.8527 970.7399 1002.1751 1021.3354 1025.3550 1036.7721 1053.8122 1061.9551 1079.1670 1090.1731 1093.1977 1121.2886 1176.1437 1185.3696 1205.8701 1229.4560 1262.6311 1284.7837 1306.6540 1309.6989 1329.1780 1337.3121 1352.4206 1355.4645 1367.2560 1372.6031 1378.8100 1395.6624 1407.8055 1437.5838 1451.8059 1622.8046 1650.0134 2944.6824 2968.7831 2981.5848 2994.6731 3047.2070 3050.0574 3060.3266 3113.5163 3279.1282 3456.3078 3487.7330 3507.2371 3576.2865 3599.1258 3618.9360
redmass: 7.0249 12.2930 8.5392 6.7419 7.1175 6.9233 8.2546 5.1957 4.7971 3.9599 5.4825 2.9634 6.2563 2.8216 2.8677 2.1064 1.4757 4.3358 3.2964 4.4354 4.6824 4.1479 4.0091 4.7963 3.9638 3.2259 4.2681 4.1070 5.8912 6.2071 4.4636 6.2437 4.5965 4.2557 1.1747 1.1912 1.6194 3.3469 3.5889 4.3010 3.2886 6.5457 4.4159 6.5538 3.2700 1.4959 2.6708 4.4072 3.9109 2.9427 3.8338 3.9145 4.9850 3.0421 1.3082 2.3845 1.5263 2.6886 3.5737 3.2290 1.9677 2.4440 1.7145 1.1679 1.2244 1.2164 1.5316 1.4000 1.3093 1.7295 1.3238 1.3460 1.4096 1.2653 1.2098 1.2932 1.3771 1.5091 1.2156 1.1029 1.3296 1.1721 10.5095 10.0580 1.0763 1.0725 1.0670 1.0827 1.0935 1.0977 1.0853 1.0874 1.0684 1.0650 1.0641 1.0643 1.0665 1.0666 1.0664
irintensity: 0.8528 0.1081 1.2269 2.8995 3.0702 3.0754 5.0904 2.4145 4.3390 7.4599 6.9791 29.0555 4.5651 28.9914 5.3652 94.7654 105.0727 14.6963 30.9977 0.7737 52.0182 32.9531 11.0246 22.6729 23.5046 5.6116 28.1317 30.8100 46.7562 43.4194 29.6203 34.5366 6.4228 54.4673 64.3026 182.3763 64.4412 53.4839 36.0638 109.7198 74.9068 139.0453 6.1208 110.9786 84.2363 91.2354 11.7971 175.8207 158.7926 56.6812 109.8537 42.3075 170.5355 54.6481 23.6206 39.9841 64.8858 88.8912 5.1472 151.2948 63.5559 58.6885 3.1991 57.4098 62.6986 10.3758 17.4305 29.3406 18.8907 43.7796 4.0246 1.1248 31.5963 33.3459 0.2093 10.7040 20.0451 26.0019 31.2430 42.6851 13.8886 17.5236 181.6938 59.0535 5.3978 97.1450 16.1153 3.7477 0.3553 37.4908 6.0874 0.7589 452.5119 22.7142 35.5355 43.5825 5.1218 107.1902 89.7630
temp: 298.150 k
press: 1.00000 atm
elementType: 15 8 8 8 8 8 8 8 8 8 8 8 6 6 6 6 6 6 6 6 1 1 1 1 1 1 1 1 1 1 1 1 1 1 1
symmnumber: 1
zpe: 659089.7 jmol-1
zpe.correction: 0.251034 hartree
zpe.thermalcorrener: 0.274711 hartree
zpe.thermalcorrenthalpy: 0.275655 hartree
zpe.thermalcorrgfe: 0.195269 hartree
zpe.sumelectzpe: -1480.887876 hartree
zpe.sumelectthermal: -1480.864200 hartree
zpe.sumelectthermalent: -1480.863256 hartree
zpe.sumelectthermalfe: -1480.943641 hartree
dipole: -1.5172 1.4052 -1.4155
dipole: 2.5060
quadrupole: -125.7023 -109.5522 -128.6965
quadrupole: 3.2431 -16.8703 3.5706
quadrupole: -4.3853 11.7647 -7.3795 3.2431 -16.8703 3.5706
hfenergy: -1481.1389102 hartree
pointgroup: C01 [X(C8H15O11P1)]
dipole: 0.7268497 0.3559588 0.5630931 debye
polarizability: 164.5994514|-0.5628316|143.4710201|3.0597369|4.4187111|130.0771404 unknown
InChI: InChI=1S/C8H15O11P/c9-2-4(11)6(12)7(13)5(19-20(16,17)18)1-3(10)8(14)15/h4-7,9,11-14,16-17H,1-2H2
charge 0 multiplicity 1
35 atoms
P  0.856651 2.707902 -0.018903
O  0.584367 1.065606 -0.384525
O  -1.007031 -1.493003 1.810915
O  -2.372343 0.940921 1.235351
O  -2.992937 -1.429533 -1.474091
O  -4.64277 1.146751 -0.417016
O  1.554396 -1.648273 -1.376342
O  0.556802 3.472589 -1.514065
O  -0.64377 3.038196 0.785443
O  2.166497 3.120358 0.771382
O  4.079067 -2.688849 -1.36232
O  4.39361 -1.871585 0.794512
C  -0.785571 -0.800848 0.525833
C  -2.040104 0.002174 0.133079
C  0.47139 0.079732 0.753049
C  -3.241313 -0.938137 -0.10474
C  1.779604 -0.703609 0.894838
C  -4.604316 -0.229636 0.071657
C  2.235643 -1.45367 -0.347549
C  3.67882 -2.012775 -0.22405
H  -0.603311 -1.579358 -0.228547
H  -1.861287 0.552616 -0.807446
H  0.310789 0.644774 1.694506
H  -3.20371 -1.788742 0.611654
H  1.638909 -1.446712 1.708232
H  2.6019 -0.047908 1.237342
H  -5.379252 -0.77031 -0.502161
H  -4.873843 -0.267765 1.148726
H  -1.509106 -0.846433 2.381828
H  -1.791723 1.757065 1.140809
H  -3.676878 -2.105449 -1.708472
H  -4.008893 1.642634 0.168991
H  1.332932 3.538413 -2.126824
H  -0.761003 3.956324 1.134137
H  5.005085 -3.037062 -1.24213
