program: Gaussian 09
title: 000010659
version: EM64L-G09RevD.01
frameworkgroup: C1[X(C12H14O4)]
method: RPBEPBE
basis: SDD
operation: Freq
keyword: #pfreq=noraman
keyword: PBEPBE/SDD
title: #p freq=noraman PBEPBE/SDD
converged: YES YES NO NO
title: Mulliken charges:
elementType: O O O O C C C C C C C C C C C C H H H H H H H H H H H H H H
charge: -0.285809 -0.278614 -0.272191 -0.263814 0.499678 0.111734 0.028409 0.043041 0.219996 -0.571245 -0.622300 -0.193773 -0.030858 -0.514732 -0.511784 -0.573909 0.261436 0.233167 0.214051 0.222289 0.240228 0.224798 0.229990 0.250980 0.217066 0.231664 0.228227 0.234288 0.211441 0.216545
chargesum: 0.00000
title: Mulliken charges with hydrogens summed into heavy atoms:
elementType: O O O O C C C C C C C C C C C C
charge: -0.285809 -0.278614 -0.272191 -0.263814 0.499678 0.111734 0.028409 0.043041 0.219996 -0.309809 -0.175083 0.268744 0.193939 0.183304 0.182396 -0.145922
polarizability: 1.97967341e+02 -8.42410412e+00 1.53867831e+02 2.06132863e+00 3.91436678e+00 8.71007136e+01
1716.lowfreq: -3.1589 0.0005 0.0006 0.0007 5.0221 8.5585 21.5302 31.9399 47.4834
frequency: 21.4110 31.9069 47.2355 53.1033 87.6565 115.6836 151.6246 153.0020 178.2936 187.1795 193.0279 215.0483 239.4499 257.4191 297.1693 322.5039 325.8049 375.9139 423.0358 469.9857 502.6912 534.9264 554.9902 604.4179 612.4088 645.3064 692.4583 699.1465 751.7248 841.9715 859.5388 876.9741 903.4244 924.0964 929.9642 938.0516 947.3954 992.0856 1001.5843 1003.4323 1084.0591 1089.1879 1098.7915 1110.7793 1114.9229 1145.9754 1154.3015 1163.0629 1178.2594 1199.0990 1226.6680 1280.3588 1293.0581 1305.4056 1361.6186 1394.6735 1412.9404 1422.3692 1431.6743 1444.8058 1454.8678 1457.7818 1460.6294 1465.1824 1472.2171 1478.7697 1486.8776 1595.1229 1638.2718 1655.0995 2970.6319 2979.6782 2985.4556 2987.9469 3064.9837 3081.6881 3083.1794 3087.0287 3097.1805 3121.5846 3125.6439 3127.6772 3154.4340 3195.2822
redmass: 2.8864 2.9224 2.9557 3.9264 2.5487 2.1412 2.4702 2.2906 1.8535 2.5193 1.8030 3.7501 4.4381 3.4114 4.6578 5.4771 4.4541 2.3668 6.7180 3.2548 4.6335 5.4254 4.1595 4.1635 3.1422 4.7355 4.1121 9.2077 4.4692 7.0700 1.9284 2.7490 1.9765 2.3596 5.3639 1.5153 4.0734 4.8095 1.2744 4.6008 1.5569 2.5685 2.3801 1.2527 1.2472 1.1102 1.6512 1.5915 2.6381 1.3633 1.6100 1.3108 1.3671 4.8129 1.2462 5.7933 4.0189 1.2456 1.3560 1.3185 1.1253 1.0549 1.0495 1.0513 1.0640 1.1329 2.6820 10.6465 8.1515 4.8293 1.0653 1.0325 1.0640 1.0302 1.0930 1.0695 1.1010 1.1046 1.0870 1.1042 1.1037 1.1033 1.0913 1.1148
irintensity: 6.0640 1.5314 1.9647 1.2124 3.3844 1.8239 4.3389 8.9075 2.0043 0.7500 3.3727 4.1583 2.5348 0.8536 2.8435 3.0869 11.0481 0.0344 4.3176 1.8299 1.4289 0.9293 6.5428 2.7304 11.8695 5.0116 9.9135 0.5151 8.8387 17.8808 35.1473 23.7240 13.9325 51.8639 6.0331 65.7149 19.9617 138.6984 5.6598 170.1412 11.7679 40.8732 43.9731 0.0580 2.6701 3.7158 3.9857 5.2635 85.9229 4.0551 95.5319 2.0084 5.7491 49.6581 10.0248 101.1368 86.7563 4.4165 18.3111 4.7634 24.0391 10.8134 13.5506 43.6369 40.1846 4.0259 141.1515 68.1341 32.4083 11.6205 111.2650 76.5416 28.4511 60.1032 1.0945 23.2813 29.9338 39.7340 11.2994 27.4471 20.4646 25.5060 2.7412 29.3532
temp: 298.150 k
press: 1.00000 atm
elementType: 8 8 8 8 6 6 6 6 6 6 6 6 6 6 6 6 1 1 1 1 1 1 1 1 1 1 1 1 1 1
symmnumber: 1
zpe: 616688.5 jmol-1
zpe.correction: 0.234884 hartree
zpe.thermalcorrener: 0.251516 hartree
zpe.thermalcorrenthalpy: 0.252460 hartree
zpe.thermalcorrgfe: 0.188849 hartree
zpe.sumelectzpe: -765.276589 hartree
zpe.sumelectthermal: -765.259957 hartree
zpe.sumelectthermalent: -765.259013 hartree
zpe.sumelectthermalfe: -765.322624 hartree
dipole: 1.6688 2.0668 1.7294
dipole: 3.1698
quadrupole: -84.5194 -87.7393 -94.5598
quadrupole: 0.2891 1.0147 3.1087
quadrupole: 4.4202 1.2002 -5.6203 0.2891 1.0147 3.1087
hfenergy: -765.5114731 hartree
pointgroup: C01 [X(C12H14O4)]
dipole: -0.7566148 -0.7631636 0.6327171 debye
polarizability: 196.396014|-11.0465655|155.1834974|5.3851661|-4.8725794|87.3563743 unknown
InChI: InChI=1S/C12H14O4/c1-4-5-8-6-9(13-2)11-12(10(8)14-3)16-7-15-11/h4,6H,1,5,7H2,2-3H3
charge 0 multiplicity 1
30 atoms
O  -0.99203 -2.237804 -0.288044
O  -2.762629 -0.655214 -0.152104
O  1.979702 -1.414438 -0.599135
O  -2.184643 2.457577 -0.28045
C  1.16648 0.863876 -0.530192
C  -0.451325 -0.911999 -0.295161
C  -1.502094 0.030049 -0.219056
C  0.894125 -0.539348 -0.450361
C  -1.255501 1.410768 -0.316356
C  0.107017 1.791284 -0.470249
C  2.61101 1.342525 -0.646386
C  -2.393756 -2.053772 0.153179
C  3.288722 1.449494 0.713401
C  1.925878 -2.705581 0.11176
C  -3.614464 2.12483 -0.157989
C  4.42534 0.800781 1.068766
H  0.318175 2.863543 -0.534143
H  3.18989 0.655783 -1.286957
H  2.613317 2.339797 -1.12936
H  -2.452503 -2.215313 1.249112
H  -3.041827 -2.730747 -0.421401
H  2.789732 2.108761 1.440502
H  2.904171 -3.172181 -0.078438
H  1.112531 -3.342735 -0.27415
H  1.789492 -2.543924 1.197736
H  -4.129178 3.097154 -0.174815
H  -3.8212 1.599396 0.790872
H  -3.95101 1.498247 -1.002529
H  4.871631 0.925198 2.062306
H  4.937647 0.124694 0.373443
