program: Gaussian 09
title: 000132564
version: EM64L-G09RevD.01
frameworkgroup: C1[X(C14H18N2O)]
method: RPBEPBE
basis: SDD
operation: Freq
keyword: #p
keyword: freq=noraman
keyword: PBEPBE/SDD
title: #p freq=noraman PBEPBE/SDD
converged: YES YES NO NO
title: Mulliken charges:
elementType: O N N C C C C C C C C C C C C C C H H H H H H H H H H H H H H H H H H
charge: -0.262238 -0.148670 -0.572920 -0.053935 0.228546 -0.529845 0.251644 0.362991 -0.428075 0.108653 -0.453960 -0.547408 -0.315606 -0.349902 -0.387928 -0.403106 -0.638137 0.246218 0.217762 0.224911 0.207162 0.261532 0.198400 0.241751 0.219103 0.196132 0.233407 0.244972 0.197376 0.213987 0.236363 0.236741 0.228386 0.261183 0.274508
chargesum: 0.00000
title: Mulliken charges with hydrogens summed into heavy atoms:
elementType: O N N C C C C C C C C C C C C C C
charge: -0.262238 -0.148670 -0.037229 -0.053935 0.228546 -0.065865 0.251644 0.362991 0.003998 0.108653 -0.192428 -0.107257 0.099629 -0.116495 -0.142955 0.008256 0.063353
polarizability: 2.12237708e+02 7.71755342e+00 1.95843558e+02 -6.68411275e+00 8.53028979e+00 9.97993597e+01
1716.lowfreq: -10.0143 -8.1423 0.0003 0.0006 0.0008 7.3554 43.8631 57.1333 79.8015
frequency: 43.7641 57.1305 79.7850 92.4711 101.9658 130.2601 140.0156 186.8088 201.2920 227.6570 231.5969 254.1482 292.7832 308.2210 330.5383 352.4948 404.8030 419.4742 442.9912 491.0534 522.8884 533.6518 592.8415 598.4805 607.3180 637.0710 646.7329 664.6094 716.4633 762.0036 780.5836 791.5438 797.3302 858.2884 862.0946 892.0170 894.0144 926.5665 939.0787 944.5558 1010.6183 1021.6537 1050.8856 1071.6575 1082.0016 1088.2021 1108.2030 1117.5883 1120.2409 1158.0654 1170.5311 1175.8697 1195.7537 1208.4911 1221.7473 1230.1604 1263.3502 1277.6707 1299.4209 1307.0795 1340.1112 1349.4419 1359.4735 1367.2065 1371.3604 1374.4682 1410.2316 1427.2362 1452.1080 1458.0236 1461.5552 1465.4143 1472.9690 1480.8606 1485.4889 1496.9737 1498.3247 1552.2363 1588.3719 1617.5419 1638.1353 2883.6612 2962.9188 2966.9125 2971.1992 2972.3034 2997.6071 3019.0476 3045.6703 3046.6281 3060.1659 3060.9394 3083.0827 3102.5725 3140.0362 3168.3220 3205.8788 3451.7202 3578.7855
redmass: 4.2141 3.8208 2.7986 1.2549 1.7722 3.7483 2.2548 3.2168 2.8279 1.4331 3.4217 2.7949 2.4666 2.1906 3.2772 3.8420 5.6395 5.1250 3.4862 3.6304 5.1394 3.1472 1.8963 2.7606 1.9423 3.5684 4.9938 3.4216 3.7609 5.2360 1.3846 1.3753 1.5163 3.7000 1.9338 3.1954 2.1569 1.3180 2.0117 3.1839 2.3287 2.1660 1.9463 2.0660 1.9212 2.7675 1.8161 1.3076 1.3844 2.3059 1.8132 1.3998 1.5613 1.6346 1.4296 1.8763 1.1934 1.1848 1.4744 1.7476 2.0690 1.7277 1.5760 2.9046 2.0060 1.5567 4.3474 1.9609 1.2416 1.1368 2.2806 1.0420 1.1139 1.2783 1.6838 1.0975 1.2159 5.8100 8.1006 7.7796 1.0946 1.0717 1.0682 1.0681 1.0444 1.0587 1.0603 1.0862 1.1017 1.0916 1.0949 1.1017 1.0984 1.0983 1.0881 1.0962 1.0977 1.0449 1.0974
irintensity: 0.2446 1.2204 5.9356 0.6701 1.1349 2.4448 4.4280 4.8692 2.1531 27.0804 4.4080 0.8930 19.6575 1.4096 5.8724 12.0860 0.4848 1.3120 0.1934 0.3203 4.4196 2.1097 108.3806 15.0867 80.8352 26.1346 3.6365 3.0272 12.3252 7.5833 30.0434 35.2077 15.1860 4.0823 3.1168 11.6865 14.5728 0.1987 3.5708 9.9933 21.2483 20.7145 57.4816 9.5630 7.7295 22.2561 11.2475 1.9178 30.7402 3.3534 43.6330 24.7431 21.9268 7.4515 1.5437 69.0079 10.8476 3.3988 15.6018 15.7465 20.0813 6.0030 6.1175 6.3268 3.0186 9.2502 38.1462 42.6800 4.1725 13.8367 50.7108 12.9478 7.2964 24.5931 45.5074 6.8371 33.5795 9.8751 9.2451 11.3266 41.5409 86.4150 22.6856 82.9272 87.5840 44.9544 34.2783 47.9592 30.1773 20.1589 30.3654 50.1755 46.9984 12.7481 8.9297 12.3119 1.8586 1.7373 0.2751
temp: 298.150 k
press: 1.00000 atm
elementType: 8 7 7 6 6 6 6 6 6 6 6 6 6 6 6 6 6 1 1 1 1 1 1 1 1 1 1 1 1 1 1 1 1 1 1
symmnumber: 1
zpe: 773514.7 jmol-1
zpe.correction: 0.294616 hartree
zpe.thermalcorrener: 0.310698 hartree
zpe.thermalcorrenthalpy: 0.311642 hartree
zpe.thermalcorrgfe: 0.251225 hartree
zpe.sumelectzpe: -727.746878 hartree
zpe.sumelectthermal: -727.730796 hartree
zpe.sumelectthermalent: -727.729852 hartree
zpe.sumelectthermalfe: -727.790270 hartree
dipole: -3.2968 0.1829 -0.1434
dipole: 3.3049
quadrupole: -89.3344 -87.5181 -103.5159
quadrupole: 7.8153 2.7373 -1.4879
quadrupole: 4.1217 5.9380 -10.0597 7.8153 2.7373 -1.4879
hfenergy: -728.0414946 hartree
pointgroup: C01 [X(C14H18N2O1)]
dipole: 1.2976408 0.0532038 0.0631734 debye
polarizability: 212.0796678|-7.8915363|196.1076588|-6.2502115|-8.247049|99.6932993 unknown
InChI: InChI=1S/C14H18N2O/c1-16-9-10(6-7-15)14-11-3-2-8-17-13(11)5-4-12(14)16/h4-5,9H,2-3,6-8,15H2,1H3
charge 0 multiplicity 1
35 atoms
O  -3.401938 -0.229313 0.170681
N  1.883775 -2.013354 -0.048775
N  2.624101 3.889425 0.408058
C  0.345323 -0.301775 -0.15786
C  -0.971811 0.259889 -0.118748
C  -1.241582 1.74935 -0.312388
C  0.517513 -1.717484 0.054287
C  1.676076 0.252031 -0.392968
C  -2.657184 2.136908 0.16985
C  -2.043363 -0.63567 0.11781
C  2.567878 -0.822551 -0.319854
C  2.091357 1.68799 -0.621111
C  -3.677769 1.121528 -0.359102
C  -0.56466 -2.589069 0.311575
C  -1.850785 -2.030429 0.339766
C  2.339967 2.469498 0.697139
C  2.470853 -3.344835 0.085683
H  -0.488133 2.349427 0.227257
H  -1.133293 2.015169 -1.384299
H  -2.69894 2.13683 1.275646
H  -2.92261 3.153449 -0.176084
H  3.649852 -0.820822 -0.44933
H  3.027292 1.712026 -1.21704
H  1.337703 2.243698 -1.205337
H  -4.705732 1.343625 -0.029165
H  -3.650028 1.082113 -1.468459
H  -0.417832 -3.661279 0.477766
H  -2.736378 -2.645968 0.523946
H  3.14461 1.942772 1.265666
H  1.430404 2.419855 1.325419
H  2.271549 -3.769442 1.087708
H  2.065932 -4.038573 -0.675247
H  3.562101 -3.278696 -0.051546
H  3.440905 4.033282 -0.195193
H  2.650248 4.495993 1.23325
