program: Gaussian 09
title: 000010657
version: EM64L-G09RevD.01
frameworkgroup: C1[X(C15H24)]
method: RPBEPBE
basis: SDD
operation: Freq
keyword: #p
keyword: freq=noraman
keyword: PBEPBE/SDD
title: #p freq=noraman PBEPBE/SDD
converged: YES YES NO NO
title: Mulliken charges:
elementType: C C C C C C C C C C C C C C C H H H H H H H H H H H H H H H H H H H H H H H H
charge: -0.092613 -0.073519 -0.220194 -0.618849 -0.526913 -0.051199 -0.503518 0.424120 -0.426038 0.437381 -0.417295 -0.753113 -0.746116 -0.853541 -0.839794 0.242575 0.211862 0.228903 0.215604 0.218343 0.218178 0.217668 0.219549 0.218787 0.223291 0.203918 0.206883 0.218373 0.210557 0.214541 0.211901 0.210382 0.228376 0.221088 0.224239 0.230538 0.226941 0.219567 0.219136
chargesum: 0.00000
title: Mulliken charges with hydrogens summed into heavy atoms:
elementType: C C C C C C C C C C C C C C C
charge: 0.149962 0.138343 0.008709 -0.184902 -0.091067 0.168350 -0.061439 0.424120 -0.222120 0.437381 -0.210411 -0.109641 -0.095457 -0.177677 -0.174150
polarizability: 1.79966545e+02 -5.08628952e+00 1.70832197e+02 -3.92292941e-01 4.21617406e+00 1.15269093e+02
1716.lowfreq: -17.2006 -0.0009 -0.0005 -0.0004 4.1292 8.1184 63.8231 66.1626 79.6682
frequency: 63.8073 66.1359 79.6605 117.7280 148.3307 179.4609 196.4725 202.2548 231.3581 238.9107 241.8105 251.5814 268.5680 283.8229 294.2088 311.2128 383.3345 394.2478 402.0485 433.2965 441.9744 473.4653 518.4641 551.6777 561.6665 636.5242 650.7124 750.7507 792.7589 800.6502 825.0213 845.4983 883.1712 907.2956 913.6668 926.5202 952.8512 958.7137 966.3434 975.9906 997.7109 1022.1325 1037.1458 1045.5187 1054.9038 1073.3773 1085.0635 1098.6471 1109.9622 1133.7888 1144.7024 1160.4807 1166.6053 1180.3091 1183.4309 1193.9912 1221.3281 1244.0384 1272.8349 1284.8539 1288.8683 1304.7589 1315.7475 1318.7709 1325.2765 1331.5859 1345.2085 1353.6497 1358.7428 1363.6798 1376.2130 1392.0251 1392.7412 1393.2385 1452.5247 1456.7773 1458.3039 1460.9943 1466.7961 1467.0866 1472.0536 1476.6966 1479.0462 1483.1577 1491.4186 1690.9009 1698.8477 2904.9194 2922.0345 2928.9159 2943.4991 2949.1682 2954.3066 2955.3200 2958.5839 2967.8080 2970.7514 2977.2876 2994.7946 3005.3693 3006.9821 3023.8733 3030.8144 3061.6641 3064.3204 3068.6627 3072.5742 3074.0496 3074.5291 3086.0445 3091.0920
redmass: 2.9336 2.5445 2.8847 2.3178 2.9895 1.1295 1.4187 1.5557 1.5165 1.2258 1.8947 1.8498 2.1145 2.4626 2.3502 2.6957 2.8200 3.1403 2.6892 2.7031 2.4506 3.0943 3.1352 2.7120 2.7351 3.7907 3.7308 1.9294 1.2886 3.0861 1.4755 2.4428 2.1227 1.6409 1.3025 1.7728 1.5457 1.5820 1.8350 2.0879 1.6303 1.8205 1.5068 1.8414 2.0370 1.9490 2.7586 2.0720 1.8811 2.0623 1.3881 2.0741 1.5362 1.7363 1.7507 1.9190 1.6203 1.3950 1.2820 1.2993 1.2825 1.3910 1.5344 1.2800 1.5231 1.4347 1.5970 1.5622 1.8230 2.0290 1.2075 1.2354 1.2229 1.2348 1.0839 1.0788 1.0873 1.0510 1.0451 1.0628 1.0616 1.0530 1.0609 1.0471 1.0551 7.0440 6.5470 1.0802 1.0806 1.0664 1.0660 1.0685 1.0476 1.0638 1.0379 1.0457 1.0712 1.0364 1.0934 1.0951 1.0948 1.0964 1.0957 1.0994 1.0991 1.0988 1.0984 1.0982 1.0980 1.0903 1.0908
irintensity: 0.0349 0.0142 0.1553 0.1209 0.0360 1.0541 1.5330 0.0162 0.1145 0.6790 0.1646 1.0029 2.3142 0.8834 1.7435 0.7994 0.1979 0.2713 1.2821 0.5984 2.4929 0.8409 1.8952 1.3692 3.7571 0.3809 0.6983 3.3682 11.3439 0.3915 23.2028 2.0372 4.4378 2.7391 4.0356 2.2798 0.8301 0.2993 3.1341 2.2767 1.1649 6.0265 7.3441 6.6278 5.8530 6.1982 1.7655 3.0814 6.1537 4.9223 1.1460 1.2480 6.0460 6.2358 9.3792 3.8116 1.1861 4.1959 1.2311 1.9026 1.9844 3.0101 0.6341 0.2977 2.7772 0.9546 1.1694 2.8096 1.1886 5.6615 22.5361 2.2000 19.8374 27.2641 5.1755 9.1300 5.3100 15.8393 2.0136 9.3433 12.1447 5.3120 14.1415 8.8305 10.0729 1.9848 2.4633 10.4000 11.3796 21.6764 25.1708 27.9631 34.8783 69.6427 44.1808 38.0806 43.1587 26.1959 32.8692 36.9436 58.5330 31.0012 26.5883 24.7738 14.5402 80.2067 57.5114 30.8210 24.0177 62.6093 51.0481
temp: 298.150 k
press: 1.00000 atm
elementType: 6 6 6 6 6 6 6 6 6 6 6 6 6 6 6 1 1 1 1 1 1 1 1 1 1 1 1 1 1 1 1 1 1 1 1 1 1 1 1
symmnumber: 1
zpe: 917148.6 jmol-1
zpe.correction: 0.349323 hartree
zpe.thermalcorrener: 0.365356 hartree
zpe.thermalcorrenthalpy: 0.366301 hartree
zpe.thermalcorrgfe: 0.307534 hartree
zpe.sumelectzpe: -584.795781 hartree
zpe.sumelectthermal: -584.779748 hartree
zpe.sumelectthermalent: -584.778804 hartree
zpe.sumelectthermalfe: -584.837571 hartree
dipole: 0.0757 -0.3409 -0.2230
dipole: 0.4143
quadrupole: -92.7559 -91.8173 -95.5767
quadrupole: -0.9107 0.2051 0.6899
quadrupole: 0.6274 1.5660 -2.1934 -0.9107 0.2051 0.6899
hfenergy: -585.1451047 hartree
pointgroup: C01 [X(C15H24)]
dipole: 0.0075262 -0.1388913 -0.0850078 debye
polarizability: 178.1029146|-6.2669329|172.8417978|0.3167354|3.0937976|115.1231219 unknown
InChI: InChI=1S/C15H24/c1-10(2)13-8-6-12(4)14-7-5-11(3)9-15(13)14/h5-6,10,13-15H,7-9H2,1-4H3
charge 0 multiplicity 1
39 atoms
C  -0.054831 -0.228424 0.132271
C  1.42153 -0.230386 -0.36134
C  -0.794058 1.06648 -0.312539
C  -0.865194 -1.459166 -0.341176
C  2.168434 0.979064 0.258315
C  2.16937 -1.585283 -0.137887
C  -2.168081 1.140661 0.410251
C  0.041075 2.331988 -0.111582
C  1.373194 2.266218 0.16148
C  -2.356492 -1.353155 -0.043823
C  -2.925163 -0.17191 0.323619
C  3.585596 -1.56523 -0.765073
C  2.244115 -2.02406 1.346645
C  -0.665344 3.667803 -0.268761
C  -3.156128 -2.635788 -0.168704
H  -0.046252 -0.228115 1.244372
H  1.392688 -0.067279 -1.463214
H  -1.013548 0.972658 -1.402029
H  -0.478958 -2.380561 0.139991
H  -0.713883 -1.609768 -1.4339
H  3.142325 1.121916 -0.250423
H  2.413522 0.771642 1.322094
H  1.591065 -2.360927 -0.681929
H  -2.788419 1.945546 -0.031046
H  -2.012672 1.425324 1.473911
H  1.931406 3.20368 0.304666
H  -3.998478 -0.145989 0.563202
H  4.264158 -0.886088 -0.21628
H  4.038398 -2.574326 -0.74132
H  3.552456 -1.231703 -1.819883
H  2.84621 -1.318147 1.948541
H  2.722536 -3.017867 1.42935
H  1.24335 -2.093175 1.810069
H  -1.185612 3.732269 -1.245737
H  0.049887 4.506612 -0.207606
H  -1.436387 3.823789 0.510425
H  -4.229073 -2.473975 0.035367
H  -2.785323 -3.409863 0.533024
H  -3.063122 -3.065165 -1.186841
