program: Gaussian 09
title: 000132518
version: EM64L-G09RevD.01
frameworkgroup: C1[X(C7H14O5)]
method: RPBEPBE
basis: SDD
operation: Freq
keyword: #pfreq=noraman
keyword: PBEPBE/SDD
title: #p freq=noraman PBEPBE/SDD
converged: YES YES NO NO
title: Mulliken charges:
elementType: O O O O O C C C C C C C H H H H H H H H H H H H H H
charge: -0.285084 -0.444829 -0.463648 -0.449558 -0.467810 -0.147677 -0.165923 -0.154964 -0.074375 -0.127563 -0.434623 -0.510482 0.257201 0.214110 0.215876 0.216106 0.231379 0.243456 0.239826 0.353666 0.381071 0.353580 0.349460 0.245682 0.201964 0.223160
chargesum: 0.00000
title: Mulliken charges with hydrogens summed into heavy atoms:
elementType: O O O O O C C C C C C C
charge: -0.285084 -0.091163 -0.082577 -0.095979 -0.118351 0.109524 0.048187 0.060911 0.141731 0.103816 0.048660 0.160324
polarizability: 1.07795111e+02 1.00861086e+00 9.03785735e+01 -1.76821056e+00 6.52409862e-01 7.27753764e+01
1716.lowfreq: -13.0052 -2.3248 -0.0009 -0.0006 -0.0003 8.3839 39.4460 60.5971 100.1005
frequency: 39.1873 60.5713 100.0810 141.8016 154.2869 169.0002 192.7033 232.2813 254.3315 278.7090 304.7637 314.3297 357.8341 376.7804 390.0200 403.2281 427.8604 484.9404 495.6331 532.1036 579.4503 662.8656 692.4688 838.4903 896.2528 924.4823 948.8369 978.1278 989.9233 1012.0652 1033.4221 1059.1197 1068.3144 1071.6468 1105.3897 1115.0395 1124.0551 1138.1172 1169.2032 1187.0357 1199.3487 1235.3691 1243.9758 1268.2955 1287.7460 1296.7824 1313.0088 1327.5022 1337.6936 1355.3591 1362.1833 1381.4974 1397.1627 1418.1493 1441.2703 1454.7024 1467.1443 1480.7682 2945.1626 2953.5303 2956.9727 2962.2885 2989.1936 3005.0141 3013.7866 3052.8628 3101.5259 3111.3946 3402.4643 3553.8198 3563.4350 3576.5116
redmass: 4.9785 4.4430 2.6053 3.2596 2.1628 2.0620 3.6265 3.2939 3.2582 4.8061 3.3365 1.9153 2.1526 3.0660 1.2416 1.2690 3.8138 4.6821 4.1664 3.4364 3.1471 2.8559 1.0872 3.5669 3.7474 5.5531 2.3978 6.1162 4.1002 2.5524 2.8972 2.6081 3.5600 2.0986 2.9860 2.0529 1.3766 1.4586 1.6124 1.3456 1.2998 1.1541 1.3000 1.2386 1.3163 1.2148 1.2819 1.2105 1.3289 1.4356 1.2323 1.4358 1.5228 1.4528 1.1590 1.0529 1.0792 1.0549 1.0816 1.0389 1.0814 1.0844 1.0847 1.0850 1.0633 1.0966 1.1031 1.1029 1.0658 1.0656 1.0660 1.0664
irintensity: 6.1036 0.8129 3.5844 14.2429 1.9004 1.1861 4.1435 27.2401 6.0922 3.2347 13.0120 40.7602 46.9509 14.4902 147.0535 169.4853 25.4561 10.2455 8.1082 20.4331 27.9212 4.8243 212.5111 7.5321 51.0933 103.8955 28.3696 60.8271 47.1764 9.1422 10.6469 61.5174 22.8108 36.3280 97.9696 10.5672 1.4519 14.6247 15.1556 21.0857 25.1828 16.6091 17.4956 41.0207 36.0191 1.4388 20.7666 48.0077 3.9237 11.3546 13.2089 8.6563 13.7897 9.8172 7.0350 9.8830 6.1697 13.4486 5.0767 56.1104 48.6963 22.4638 37.3153 58.9990 34.1329 43.1615 16.8306 28.6334 102.8326 7.4051 8.4703 9.3905
temp: 298.150 k
press: 1.00000 atm
elementType: 8 8 8 8 8 6 6 6 6 6 6 6 1 1 1 1 1 1 1 1 1 1 1 1 1 1
symmnumber: 1
zpe: 560813.4 jmol-1
zpe.correction: 0.213603 hartree
zpe.thermalcorrener: 0.226999 hartree
zpe.thermalcorrenthalpy: 0.227943 hartree
zpe.thermalcorrgfe: 0.173999 hartree
zpe.sumelectzpe: -650.223146 hartree
zpe.sumelectthermal: -650.209749 hartree
zpe.sumelectthermalent: -650.208805 hartree
zpe.sumelectthermalfe: -650.262749 hartree
dipole: 0.0373 0.6560 1.2987
dipole: 1.4554
quadrupole: -67.2099 -73.7697 -72.3538
quadrupole: -1.9015 -5.9882 -1.9705
quadrupole: 3.9013 -2.6586 -1.2427 -1.9015 -5.9882 -1.9705
hfenergy: -650.4367483 hartree
pointgroup: C01[X(C7H14O5)]
dipole: 0.0257315 0.2471926 -0.5158661 debye
dipolederiv: -1.1555447 0.0604829 0.0012277 0.0480106 -0.4459433 0.0362531 0.1178438 -0.0014376 -0.3980485 -0.3248411 -0.0686729 -0.1657919 -0.0613325 -0.8900992 0.0672469 -0.1657538 0.1260036 -0.4506338 -0.6083385 0.1258354 -0.1682338 0.143484 -0.735085 0.0299552 -0.2019322 0.0422928 -0.4948462 -0.6180253 -0.2875691 0.0835004 -0.3034038 -0.5841493 -0.1547119 0.0397128 -0.2145259 -0.4518537 -0.9958701 0.07297 -0.0224602 0.0762111 -0.5208532 -0.1685686 -0.0243917 -0.1960892 -0.2625206 -0.2006734 0.0514157 -0.003683 0.0490983 -0.1754977 -0.0312765 -0.1312848 -0.0564719 0.0446122 0.2002602 -0.0287402 0.0527433 -0.0697573 0.6926109 -0.1050177 0.0464061 -0.0766529 0.363515 0.3121764 -0.1829425 0.1397529 -0.1326817 0.4091419 -0.0525571 0.1796539 -0.0200096 0.3846382 0.6075025 -0.2183948 -0.1144757 -0.2854991 0.1321405 -0.0142888 -0.2395904 -0.02133 0.3273568 0.2778949 0.2412249 0.0341706 0.3013395 0.4303879 0.1110396 0.0691913 0.124871 0.2849993 0.6608725 -0.1422831 -0.0483536 -0.0753363 0.3395705 0.0737729 -0.0026989 0.0988871 0.2657026 0.6749822 0.0270229 0.0430452 0.136554 0.2448426 -0.0348433 0.1709338 -0.0364222 0.3025359 0.0325657 -0.0197442 0.0264593 -0.0425793 0.0398461 0.0300574 0.0476213 0.0407336 -0.107357 0.0508749 -0.0015458 0.0001567 0.0043886 -0.0218662 0.0162017 -0.0136042 0.0211065 -0.1792024 0.0059744 0.0039468 -0.0058157 0.0156828 -0.0408792 -0.0484412 -0.018463 -0.0548864 -0.1850556 -0.0162369 0.0270184 -0.0342436 0.0464673 0.0386387 0.0056582 0.0326003 0.0047448 -0.1619322 0.0322659 -0.0371325 -0.0189686 -0.0249446 0.0071167 -0.0089204 -0.0139736 -0.0209659 -0.139402 0.0305573 0.0285484 0.0554997 0.0344542 0.0823025 0.0533091 0.0324179 0.0055086 -0.0754874 -0.0136381 -0.0515924 0.0051653 -0.0526056 -0.1503677 -0.0319975 0.0155163 0.0120627 0.0857999 0.1388995 0.1449076 0.0998532 0.1011138 0.3313056 0.0043266 0.1137946 -0.0030399 0.2865332 0.2927938 0.0506795 0.0421195 0.0421636 0.4697902 0.0239453 0.0361828 0.0235704 0.2630829 0.2864938 0.1467294 -0.0798371 0.0992789 0.1326524 0.057876 -0.0960697 0.0702924 0.2944446 0.4007085 0.0323305 0.0209006 0.0020438 0.2253536 0.1118999 0.0938371 0.0988134 0.0856691 0.0339051 -0.0180213 -0.0152104 -0.1168599 -0.1160356 0.0433248 -0.0508837 0.0487488 0.0722264 -0.0077464 -0.0168817 -0.001564 -0.0353412 0.0611791 0.0574901 -0.1434604 0.0557112 -0.1854995 -0.0978129 0.0604078 0.0740433 0.1000506 0.0438972 -0.0717339 0.1063944 -0.0715155 0.0307228 unknown
polarizability: 107.5404548|-2.5964518|90.6811218|-0.64701|-0.9602825|72.727484 unknown
InChI: InChI=1S/C7H14O5/c1-12-7-5(10)3(2-8)4(9)6(7)11/h3-11H,2H2,1H3
charge 0 multiplicity 1
26 atoms
O  -2.392793 0.88786 0.491027
O  -0.001383 2.511069 -0.547962
O  1.381348 -2.003898 0.606545
O  -1.66584 -2.061804 -0.565329
O  3.524959 -0.339482 0.104369
C  1.180313 0.362865 -0.351543
C  -0.030586 1.204865 0.107608
C  0.6746 -1.131465 -0.332307
C  -1.260585 0.351738 -0.256258
C  -0.812191 -1.076708 0.10312
C  2.432127 0.583906 0.509831
C  -3.693121 0.352206 0.060373
H  1.401841 0.661063 -1.395482
H  -0.035743 1.331131 1.213744
H  0.733096 -1.552728 -1.358112
H  -1.458066 0.408499 -1.350953
H  -0.843149 -1.211296 1.20546
H  2.240125 0.319735 1.561679
H  2.769076 1.635925 0.451483
H  -0.821596 2.999176 -0.279092
H  2.360864 -1.872114 0.453214
H  -1.347278 -2.965044 -0.311842
H  3.874645 -0.065391 -0.779957
H  -3.748804 -0.739301 0.221393
H  -3.870632 0.563662 -1.014559
H  -4.448128 0.871628 0.671348
