program: Gaussian 09
title: 000132499
version: EM64L-G09RevD.01
frameworkgroup: C1[X(C16H24ClNO)]
method: RPBEPBE
basis: SDD
operation: Freq
keyword: #p
keyword: freq=noraman
keyword: PBEPBE/SDD
title: #p freq=noraman PBEPBE/SDD
converged: YES YES NO NO
title: Mulliken charges:
elementType: Cl O N C C C C C C C C C C C C C C C C H H H H H H H H H H H H H H H H H H H H H H H H
charge: -0.069577 -0.462973 -0.069994 0.323122 -0.231791 -0.479276 -0.515594 -0.407630 -0.394313 -0.390264 -0.442217 0.607484 -0.389048 -0.353295 -0.618773 -0.634509 -0.236432 -0.268970 -0.236013 0.236760 0.220013 0.195150 0.204118 0.224784 0.231128 0.188237 0.189169 0.213982 0.181998 0.202274 0.199186 0.212062 0.338579 0.228407 0.222479 0.187197 0.224164 0.219038 0.186435 0.244217 0.256163 0.230238 0.234283
chargesum: 0.00000
title: Mulliken charges with hydrogens summed into heavy atoms:
elementType: Cl O N C C C C C C C C C C C C C C C C
charge: -0.069577 -0.124394 -0.069994 0.323122 0.004969 -0.064112 -0.086692 0.011736 0.008839 -0.005993 -0.030969 0.607484 -0.389048 -0.124888 0.015067 0.015181 0.019731 -0.038731 -0.001729
polarizability: 2.01537402e+02 2.00694596e+01 1.68990547e+02 7.14009545e+00 4.65581988e+00 1.88129439e+02
1716.lowfreq: -16.2384 -13.5447 -8.7224 0.0016 0.0019 0.0020 14.3585 38.1503 46.1107
frequency: 1.5757 37.9245 45.8998 50.6717 66.2220 85.0826 129.4264 152.5338 184.3347 190.3590 208.2397 222.9038 232.5968 238.5545 252.9077 272.1862 287.0106 307.4393 313.8999 343.6451 369.1669 380.2214 404.0527 409.3106 446.6713 453.6684 476.7749 479.0402 503.3196 551.5118 601.8789 643.5233 665.2011 702.6971 748.7110 765.7590 771.4113 778.5102 815.6839 830.0686 848.8410 869.0013 907.2054 925.4867 929.4588 948.0626 953.1727 975.9074 985.7569 1009.7183 1025.3395 1036.4913 1038.2565 1048.8141 1052.9011 1065.9394 1076.7930 1091.8003 1093.7451 1120.2950 1127.6636 1135.1903 1145.7255 1158.9251 1171.2351 1185.8621 1202.0095 1234.2764 1253.9379 1258.9990 1265.2939 1266.9034 1288.3847 1295.5793 1316.8485 1328.9409 1336.4173 1340.9154 1343.2689 1352.2221 1364.6260 1369.7852 1384.2836 1421.3614 1425.4435 1444.7479 1447.4137 1456.2173 1457.5845 1460.2646 1462.1494 1464.8209 1466.6587 1472.2455 1474.1110 1481.1031 1486.7835 1571.9373 1602.2846 2834.6325 2842.2154 2859.1327 2956.4871 2969.2056 2979.5377 2987.0506 2991.2994 3011.6658 3016.5775 3026.3368 3027.9193 3033.1921 3035.5473 3041.6585 3049.0157 3060.2422 3076.4061 3089.1469 3132.6619 3147.1236 3160.0743 3174.1967 3528.9859
redmass: 3.1656 3.8303 4.7509 3.6389 3.6630 3.8894 3.7904 4.5482 2.1558 4.1544 2.1798 1.8441 1.8429 1.3961 2.8663 1.1512 3.2777 3.6898 2.3457 2.5929 2.2889 3.9933 2.2000 4.2861 2.8530 2.7283 3.1867 1.9622 3.7858 3.5482 4.0057 3.0579 5.4862 4.0985 2.0867 1.5612 3.9746 1.7279 3.8614 2.3420 1.8857 1.3790 2.2320 1.5322 2.1713 1.7291 1.7288 2.3002 1.3222 5.1812 2.6157 1.7567 1.9398 2.0083 1.8095 2.4853 1.6223 1.3292 1.6333 1.6367 1.8301 1.5059 2.1579 1.4232 1.1211 1.6309 2.2517 1.2656 1.4437 1.4791 2.0131 1.5618 1.5005 1.3914 1.2498 1.5841 1.4406 1.4710 1.4859 1.9466 1.5550 1.3204 2.5308 1.1426 2.0817 1.1573 1.0915 1.1044 1.1361 1.7566 1.1599 1.0825 1.0877 1.0886 1.0909 1.0495 1.0538 5.8436 6.9114 1.0684 1.0581 1.0589 1.0639 1.0587 1.0601 1.0621 1.0633 1.0846 1.0716 1.0974 1.0975 1.0731 1.0852 1.0976 1.1026 1.1020 1.1008 1.1002 1.0852 1.0897 1.0949 1.0997 1.0654
irintensity: 0.1535 0.1965 0.3761 1.4531 0.0163 0.7550 0.6676 0.0059 0.4494 2.9357 0.6379 0.4370 2.9533 0.2038 1.9763 117.9259 22.0577 17.5723 12.5912 7.2386 1.0497 4.2305 1.2611 2.7690 4.9041 1.7675 5.9016 3.8943 4.5573 8.0938 3.7501 9.3416 18.5437 3.4025 52.9374 21.8249 2.6231 7.0849 7.5917 17.5406 9.8231 0.2909 7.5673 13.0512 31.2128 0.8734 0.9301 6.0762 0.1433 29.1558 21.8671 32.5198 11.2222 8.6935 6.5221 7.9437 16.8929 3.7609 6.9705 5.6472 24.4712 7.0221 4.5289 19.2057 3.3862 10.7068 1.5175 16.2313 4.0879 3.0328 1.3462 7.2312 8.8476 3.4093 6.6429 13.1014 0.2345 10.5153 2.1368 3.4648 18.7980 7.5553 2.2892 3.4572 17.4934 1.3292 4.8933 3.8228 17.1477 12.7030 25.6619 12.7046 7.2308 9.9724 9.6237 9.4718 24.3170 6.2892 1.7815 79.3231 65.9416 252.5707 41.4594 20.8949 42.9308 41.2803 43.6577 17.6959 39.1533 74.7338 39.1466 25.3937 12.4038 28.2256 19.0408 78.0325 32.6381 31.9744 1.4655 15.3103 17.0382 13.2028 5.8895
temp: 298.150 k
press: 1.00000 atm
elementType: 17 8 7 6 6 6 6 6 6 6 6 6 6 6 6 6 6 6 6 1 1 1 1 1 1 1 1 1 1 1 1 1 1 1 1 1 1 1 1 1 1 1 1
symmnumber: 1
zpe: 964048.4 jmol-1
zpe.correction: 0.367187 hartree
zpe.thermalcorrener: 0.387085 hartree
zpe.thermalcorrenthalpy: 0.388030 hartree
zpe.thermalcorrgfe: 0.315815 hartree
zpe.sumelectzpe: -1212.641304 hartree
zpe.sumelectthermal: -1212.621405 hartree
zpe.sumelectthermalent: -1212.620461 hartree
zpe.sumelectthermalfe: -1212.692675 hartree
dipole: -0.4195 1.5123 -2.6981
dipole: 3.1213
quadrupole: -121.4840 -118.0733 -120.6308
quadrupole: 6.7867 1.6407 4.5600
quadrupole: -1.4213 1.9894 -0.5681 6.7867 1.6407 4.5600
hfenergy: -1213.0084905 hartree
pointgroup: C01 [X(C16H24Cl1N1O1)]
dipole: 0.2956149 0.5296588 1.0677604 debye
polarizability: 203.197218|-20.7067626|169.2289475|3.9581793|-3.178691|186.2312229 unknown
InChI: InChI=1S/C16H24ClNO/c1-18(2)12-14(13-8-4-5-9-15(13)17)16(19)10-6-3-7-11-16/h4-5,8-9,14,19H,3,6-7,10-12H2,1-2H3
charge 0 multiplicity 1
43 atoms
Cl 1.544127 -0.846085 -2.763444
O  -1.347307 -1.617347 -0.682775
N  1.234726 2.637988 0.025255
C  -1.439964 -0.248151 -0.112726
C  -0.053137 0.491406 -0.336266
C  -2.549438 0.426245 -0.958242
C  -1.872683 -0.349343 1.375915
C  -3.921906 -0.265528 -0.787702
C  -3.242899 -1.052036 1.531372
C  -4.334758 -0.339115 0.700676
C  0.022707 1.866889 0.379215
C  1.147016 -0.392961 0.007774
C  1.915936 -1.064119 -0.977652
C  1.55581 -0.6037 1.355423
C  1.463037 3.757187 0.960832
C  1.274055 3.08083 -1.383073
C  3.008025 -1.901832 -0.671649
C  2.640351 -1.437573 1.694525
C  3.369957 -2.095562 0.678658
H  -0.019294 0.670226 -1.426368
H  -2.238461 0.397572 -2.019654
H  -2.633939 1.490203 -0.661294
H  -1.94331 0.670039 1.806341
H  -1.102243 -0.897893 1.952468
H  -3.854896 -1.28973 -1.199044
H  -4.686322 0.279747 -1.374897
H  -3.525365 -1.081441 2.601886
H  -3.151125 -2.098517 1.1830
H  -4.488476 0.687959 1.095374
H  -5.300538 -0.87057 0.803557
H  -0.911271 2.443038 0.148977
H  0.038576 1.724984 1.475883
H  -0.566539 -2.074305 -0.274387
H  1.019874 -0.079916 2.153592
H  1.533455 3.371495 1.994009
H  0.655394 4.533866 0.935505
H  2.418623 4.254985 0.717329
H  2.208646 3.641837 -1.560304
H  0.413587 3.744242 -1.658194
H  1.274944 2.214638 -2.065571
H  3.563814 -2.389401 -1.477728
H  2.919537 -1.567842 2.745494
H  4.216276 -2.744808 0.926409
