program: Gaussian 09
title: 000132497
version: EM64L-G09RevD.01
frameworkgroup: C1[X(C13H14N8O2S)]
method: RPBEPBE
basis: SDD
operation: Freq
keyword: #p
keyword: freq=noraman
keyword: PBEPBE/SDD
title: #p freq=noraman PBEPBE/SDD
converged: YES YES NO NO
title: Mulliken charges:
elementType: S O O N N N N N N N N C C C C C C C C C C C C C H H H H H H H H H H H H H H
charge: 1.005576 -0.535868 -0.524603 -0.556584 -0.044816 -0.003035 -0.043875 -0.637643 -0.094112 -0.614180 -0.578883 0.331294 -0.020676 0.353525 -0.365964 -0.413424 -0.393028 -0.349142 -0.116133 0.060458 -0.026731 0.144045 -0.751281 -0.042822 0.258682 0.279076 0.229076 0.293958 0.292384 0.279381 0.267045 0.297911 0.337403 0.342049 0.328546 0.347407 0.329611 0.335371
chargesum: 0.00000
title: Mulliken charges with hydrogens summed into heavy atoms:
elementType: S O O N N N N N N N N C C C C C C C C C C C C C
charge: 1.005576 -0.535868 -0.524603 -0.264200 -0.044816 -0.003035 -0.043875 0.041809 -0.094112 0.061773 0.086099 0.331294 -0.020676 0.353525 -0.107282 -0.134348 -0.163952 -0.055184 -0.116133 0.060458 -0.026731 0.144045 0.093056 -0.042822
polarizability: 6.14315400e+02 6.69457900e+00 2.29224241e+02 3.79171478e+00 -6.16797899e+00 1.27696165e+02
1716.lowfreq: -8.4792 -2.5156 0.0004 0.0013 0.0016 3.7208 15.3993 21.7643 32.6447
frequency: 12.4775 21.7023 32.6307 38.0250 66.6001 87.4560 106.8386 118.4676 141.3395 147.3581 155.8622 192.2202 203.4381 207.7900 235.1334 245.8829 250.2250 279.6771 292.4717 308.0003 327.8995 341.8931 372.2880 394.1315 410.6778 427.5119 440.6024 465.4247 470.5846 474.6779 483.9058 505.4327 534.9770 541.1973 547.3864 559.4068 562.8341 583.3260 586.5679 612.8162 628.5268 634.1380 662.3195 669.1025 715.2483 728.7909 752.0038 760.9149 771.8244 799.1746 811.1125 817.6765 820.6133 838.2305 866.3817 899.5772 915.6182 953.4346 960.9724 982.4121 993.3310 1006.5705 1014.8010 1032.9242 1053.0124 1115.0237 1133.4734 1178.8407 1186.2424 1224.9619 1232.3401 1247.3187 1286.8058 1291.0706 1309.8762 1324.0341 1356.7586 1374.4587 1405.9049 1406.8793 1409.1382 1416.5124 1424.8837 1452.7767 1472.8423 1493.8491 1506.8805 1532.3189 1552.4792 1558.4917 1596.0657 1604.7790 1610.3892 1620.0804 3030.3909 3118.2892 3137.3393 3160.2273 3175.9702 3181.0591 3185.2757 3397.0699 3526.1774 3531.2226 3555.7825 3687.7912 3689.0010 3717.3659
redmass: 5.8394 6.2029 7.1526 5.1863 5.0249 5.3539 5.7969 5.7570 1.9705 5.7685 1.7856 6.7205 6.5841 6.5264 4.6075 5.5511 4.3644 8.6857 4.0346 4.0348 5.6890 4.7040 8.8706 2.9926 3.0618 3.6484 3.6888 2.5114 1.9217 2.8186 1.2403 4.2885 1.9261 2.3378 5.8203 1.1049 3.3653 5.4084 1.5076 1.0778 5.5607 5.4683 7.0409 8.1031 6.2195 4.9772 3.3372 7.4904 2.2840 6.3691 9.2383 7.3085 3.9994 1.6281 1.5629 2.0921 3.0451 1.3207 1.3718 2.8550 1.4812 2.5589 2.4165 1.8781 4.1587 1.4298 2.1739 3.4179 1.2093 1.3987 3.0951 3.1425 1.1369 5.6433 1.9825 2.6855 7.9797 3.6130 5.4219 1.1133 5.6231 1.0598 3.6846 4.9053 3.4862 2.8351 3.6565 3.3795 4.4815 3.9873 1.5699 4.3043 1.6018 2.1070 1.0240 1.0893 1.0899 1.0945 1.0955 1.1074 1.1081 1.0759 1.0442 1.0450 1.0440 1.1050 1.1045 1.1060
irintensity: 2.9457 3.3579 2.1338 3.2484 2.5468 7.8514 4.2190 6.9455 1.6776 27.7857 0.8466 1.8915 15.8177 11.8845 0.1250 25.2719 4.1971 0.5094 3.7470 10.5490 18.4560 26.4462 33.1994 23.5229 24.8011 10.9293 5.6872 73.1087 52.9842 5.8023 232.7518 2.8202 171.4029 99.2783 101.4653 3.5289 33.8541 8.8735 77.6532 49.7335 3.4005 2.2836 0.5706 15.2505 7.5997 6.1864 27.7291 14.1857 32.7275 1.2065 6.1196 167.8710 17.3417 20.7859 20.6602 17.8500 6.6912 192.2783 0.5288 17.3956 6.4163 1.9175 47.3092 15.9444 7.9506 12.0656 0.7979 5.7856 2.0496 4.5933 3.9682 0.8270 6.7461 13.6795 21.5143 10.8913 208.4949 27.0946 64.3357 3.7080 38.5918 12.4033 23.5972 84.7860 296.3615 325.7763 316.4052 46.3982 514.8399 412.7295 708.0714 61.1974 261.6080 227.5498 0.6688 14.8652 5.8265 4.5201 0.0926 0.2386 0.6605 12.4249 81.4696 63.2106 280.6166 71.6449 51.5225 49.2352
temp: 298.150 k
press: 1.00000 atm
elementType: 16 8 8 7 7 7 7 7 7 7 7 6 6 6 6 6 6 6 6 6 6 6 6 6 1 1 1 1 1 1 1 1 1 1 1 1 1 1
symmnumber: 1
zpe: 725501.0 jmol-1
zpe.correction: 0.276329 hartree
zpe.thermalcorrener: 0.299098 hartree
zpe.thermalcorrenthalpy: 0.300042 hartree
zpe.thermalcorrgfe: 0.222528 hartree
zpe.sumelectzpe: -1488.461947 hartree
zpe.sumelectthermal: -1488.439178 hartree
zpe.sumelectthermalent: -1488.438233 hartree
zpe.sumelectthermalfe: -1488.515747 hartree
dipole: -2.9228 -2.8191 4.3808
dipole: 5.9734
quadrupole: -172.7993 -132.7239 -146.7757
quadrupole: 7.6402 23.2105 -0.0496
quadrupole: -22.0330 18.0424 3.9906 7.6402 23.2105 -0.0496
hfenergy: -1488.7382752 hartree
pointgroup: C01 [X(C13H14N8O2S1)]
dipole: 1.1592635 -0.413193 -2.0020957 debye
polarizability: 614.3123442|-7.3518024|211.9125907|3.1682277|38.6330334|145.010871 unknown
InChI: InChI=1S/C13H14N8O2S/c1-24(22,23)21-7-4-2-6(3-5-7)8-10(14)18-12-9(17-8)11(15)19-13(16)20-12/h2-5,21H,14-16H2,1H3
charge 0 multiplicity 1
38 atoms
S  -6.213105 0.083482 -0.126087
O  -7.589475 -0.742263 -0.363111
O  -6.042343 1.175227 1.059424
N  -4.855885 -1.288745 0.179072
N  1.567556 -0.650691 -0.231862
N  2.515676 1.922583 0.554381
N  4.754958 1.180281 0.311236
N  0.342968 2.699443 0.724691
N  5.20884 -1.120674 -0.496674
N  3.438189 -2.599401 -0.966634
N  6.921838 0.377507 0.006266
C  -0.756356 -0.060019 0.143551
C  0.681035 0.303884 0.141399
C  -3.502609 -0.870902 0.128534
C  -1.242146 -0.984032 -0.825918
C  -1.675578 0.430905 1.11925
C  -2.594047 -1.362374 -0.856027
C  -3.022005 0.026966 1.12428
C  2.902632 -0.359469 -0.198815
C  1.190574 1.636915 0.488478
C  3.409029 0.924388 0.233358
C  3.880568 -1.371541 -0.561302
C  -5.751443 0.982648 -1.769861
C  5.569588 0.147814 -0.058598
H  -0.537295 -1.383033 -1.561965
H  -1.319301 1.072651 1.932708
H  -2.952351 -2.054202 -1.629389
H  -3.710842 0.372621 1.900403
H  -5.115011 -2.050737 -0.47284
H  -4.707969 1.309853 -1.665471
H  -5.897111 0.25141 -2.576457
H  -6.45034 1.827814 -1.838274
H  0.778356 3.60207 0.911554
H  -0.662144 2.630434 0.592774
H  4.110378 -3.324784 -1.204287
H  2.433183 -2.770903 -0.970973
H  7.565695 -0.363443 -0.256802
H  7.248192 1.286819 0.323189
